{"text_format":"1","workbook":"xlsx","n_sheets":8,"sheets":["Listings","News","Tips","Trades","Testimonials","Lookups","Slides","Business Rules"],"not_rendered":{"charts":0,"images":61,"macros":1,"external_links":2,"defined_names":15,"comments":0,"pivot_tables":0},"unopened":[],"bounds":{"document_bytes":16777216,"sheet_cells":100000,"rows_first":2000,"rows_last":500,"rows_between":2000,"halvings":0,"cell_chars":16384,"cell_head_chars":4096},"cells_cut":0,"cells_raw":0,"read":"row_number_cap","date_system":"1900"}

{"sheet":"Listings","index":0,"n_rows":522,"n_cols":81,"rows_kept":522,"cut":false,"hidden":false,"merged":[]}
["Karen Millar Listings"]
[]
["property_id","status","type","address_num","address","price","lease_price","description","description2","area","lat_calc","lng_calc","lat","lng","virtual_tour","open_house","video","videomain","lot","taxes","bedrooms","parking","bathrooms","maintenance","locker","possession","Elementary","Intermediate","Secondary","features01","features02","features03","features04","features05","features06","features07","features08","features09","features10","features11","features12","features13","features14","features15","features16","features17","features18","features19","features20","features21","features22"]
["km000001","ARCHIVE","Luxury",7,"Sulkara Ct.",998800,null,"Stunning Bungalow! Renovated & Backs Ravine!","This Family Home Will Wow You!","VICTORIA VILLAGE",null,null,43.732424999999999,-79.323280999999994,"http://tours.advirtours.com/tours/10/54/105456/uindex.html",null,null,null,"60 X 183.8","$5,142.65/2007","2+2","Double Car Garage + 4 Car Parking","1x4, 2x3,1x2 PC",null,null,"90 Days or TBA",null,null,null,"200 Amp Service","Central Vacuum","Roof 2003","Furnace  1999","Central Air Conditioning 1999","Backs on to Ravine","EXTERIOR ","4 car parking","Interlocking stone driveway","Double car garage","Professionally landscaped","Roughed-in plumbing for fountain in back garden","Interlocking stone patio","Feng Shui calming area"]
["km000002","ARCHIVE","Luxury",139,"Anndale Dr.",979900,null,"Gorgeous 3 Year New Home!","Steps to Bayview & Yonge Shopping, TTC & Parks!","BAYVIEW/SHEPPARD",null,null,43.762481000000001,-79.398557999999994,"http://tours.advirtours.com/tours/10/54/105478/uindex.html",null,null,null,"45 x 138 Irregular","$7,530.60/2007","4 + 1","Double Car Garage + 2 Car Parking","2 x 6, 1 x 4, 1 x 3,2 x 2 PC",null,null,"90 Days or TBA",null,null,null,"200 Amps Circuit Breakers","Top of the Line Appliances","Underground Sprinkler System","Main Floor Solarium, Family Room & Laundry","Central Vacuum","Central Air Conditioning","200 Amp Service","Brazilian Cherrywood Trim","3 Walk-outs from Lower Level","EXTERIOR ","Professionally landscaped","2 car parking","Double car garage","Inground pool","Interlocking brick patio","Private pool area","Fully fenced backyard"]
["km000003","ARCHIVE","Family Residential",67,"Cassandra Blvd.",549900,null,"Executive Family Home Steps to Everything!!","Hardwood Flooring, Family Sized Eat-in Kitchen & Finished Lower Level!","LAWRENCE/UNDERHILL",null,null,43.747697000000002,-79.331478000000004,null,null,null,null,"85.52 x 111 FT","$3,982.77/2007","3+1","Double Car Garage + 2 Car Parking","1x4, 2x3",null,null,"90 Days or TBA",null,null,null,"100 Amp Service","New Roof","Updated Bathrooms","Finished Lower level","Mostly Updated Windows","Exterior","2 car parking","Double car garage","Large front verandah","In-ground pool","Wooden deck","Two Sheds","Fully fenced"]
["km000004","ARCHIVE","Family Residential",87,"Duncairn",419900,null,"Rare Private Garden Backing Greenbelt!","Sought After Neighbourhood! Steps to New Shops at Don Mills!","DON MILLS/LAWRENCE",null,null,43.741028,-79.351382999999998,null,null,null,null,"35 x 120 FT","$2,703.51/2007",3,"3 Car Parking","1x4, 1x 3",null,null,"90-120 Days or TBA",null,null,null,"Backs Greenbelt","100 Amp Service","Central Air Conditioning ‘01’","Furnace ‘01’","Hardwood Flooring Throughout","Steps to TTC & DVP","EXTERIOR","3 car parking","Mature trees and shrubs in front and back yards","Aluminum soffit and fascia","Interlocking brick patio in back garden","Wooden deck","Fully fenced back garden","Access to walking trails"]
["km000005","ARCHIVE","Executive",50,"Doonaree",729900,null,"Gorgeous & Updated From Top to Bottom!","New Gourmet Kitchen Overlooks Ravine!","LAWRENCE/UNDERHILL",null,null,43.745286,-79.329047000000003,"http://tours.advirtours.com/tours/10/65/106575/uindex.html",null,null,null,"85 X 120 FT","$4,315.59/2007","3+2","Attached Double Garage + 6 Car Parking","2x4,1x2 PC",null,null,"90 Days or TBA",null,null,null,"Ravine Lot","200 Amp Service","Viessman Boiler & Hi Efficiency Water Heat ‘05’","Eavestrophs, Soffits & Gutter Guards ‘05’","Insulation in Roof ‘07’","Main Chimney Re-Built ‘07’","Central Air Conditioning Space Pack & Air Lines‘07’","Kitchen ‘07’","Trim & Doors ‘02’","2.5 New bathrooms","2 Fireplaces","Large Raised Wooden Deck Overlooking Ravine. Very Private in Summer & Fall","Landscaping ‘03’"]
["km000006","ARCHIVE","Renovator",29,"Queen Victoria",399900,null,"Come and See 'The Pocket'","Needs a Little Tender Care!","JONES/DANFORTH",null,null,43.677114000000003,-79.334947,null,null,null,null,"14.75 x 100 Feet","$2,822.19/2007",3,"1 Lane Parking Spot","2x4",null,null,"30 Days or TBA"]
["km000007","ARCHIVE","Executive",21,"Shamokin",739900,null,"Beautifully Updated & Super Spacious!","Addition on Top & Lower Level! Private Back Garden!","DON MILLS/YORK MILLS",null,null,43.759897000000002,-79.343988999999993,"http://tours.advirtours.com/tours/10/69/106916/",null,null,null,"62.5 X 120 FT","$4,144.88/2007",3,"Attached Double Garage + 2 Car Parking","1x5, 1x3, 1x2 PC",null,null,"May 2008 or TBA",null,null,null,"New Kitchen","Updated Bathrooms","100 Amp Service","Updated Windows","Main Floor Family Room Addition","Roof ‘96’","Aluminum Soffits & Fascia","Furnace ‘94’","Central Air Conditioning ‘94’","EXTERIOR","4 car parking","Double car garage","Interlocking brick front pathway and patio","Wood deck with built-in seating","Fully fenced","Mature trees and shrubs"]
["km000008","ARCHIVE","Family Residential",124,"Church",599900,null,"Super Spacious & Steps to Yonge Street!!","Hardwood Under Broadloom! 2 Main Floor Walk-outs!","YONGE/WILLOWDALE",null,null,43.775578000000003,-79.405985999999999,null,null,null,null,"50 x 136 FT","$3,948.66/2007","3+1","Single Car Garage + 4 Car Parking","1x4, 1x2",null,null,"May 2008/TBA",null,null,null,"Roof ‘07’","100 Amp Service","Hardwood Flooring Throughout","Two Fireplaces","Two Main Floor Walk-outs","In Your Neighbourhood","Steps to Yonge Street Shopping & All Amenities","Steps to Yonge Subway Line & TTC","Mitchell Field Park, Community Centre & Arena","Earl Haig Secondary School","Willowdale Middle School","EXTERIOR","4 car parking","Single car garage","Interlocking brick front walkway","Professionally landscaped front & back yards","Garden shed","Fully fenced back yard"]
["km000009","ARCHIVE","Family Residential",36,"Lynvalley",365500,null,"Updated Beauty Close to All Amenities!","Finished Lower Level with Nanny Suite!","VICTORIA PARK/LAWRENCE",null,null,43.749003000000002,-79.309669,null,null,null,null,"40 x 146 FT","$2,430.60/2007","3+1","6 Car Parking","2x4",null,null,"May 2008/TBA",null,null,null,"Updated Windows","New Kitchen","New Bathrooms","New 100 Amp Service","Central Vacuum","Hardwood Flooring Throughout","Wireless Internet Throughout","New Trim & Baseboard’s Throughout","Renovated Lower Level","Nanny Suite","EXTERIOR","6 car parking","Large front veranda","Custom garden house with wood stove & electricity","Gas hookup for BBQ"]
["km000010","ARCHIVE","Family Residential",16,"Preakness",698800,null,"Gorgeous & Spacious in the Heart of Don Mills!","Beautiful Hardwood On Main Level!","LESLIE/YORK MILLS",null,null,43.744725000000003,-79.355380999999994,null,null,null,null,"28.54 x 86.29 FT","$4,247.16/2007",3,"Double Car Garage + 2 Car Parking","1x5, 1x4, 1x2",null,null,"90 Days or TBA",null,null,null,"New Home Built in 2005","100 Amp Service","Central Air Conditioning","Central Vacuum Smart Wiring For Cable, Internet & Telephone","Stainless Steel Appliances","Walk-out Family Size Kitchen","Fully Fenced Private Back Garden","Finished Lower Level","In Your Neighbourhood","Dunlace Public School","Denlow Public School","Rippleton Public School","Windfields Junior High School","York Mills Collegiate Institute","St. Bonadventure Catholic School","GO Station","Don Mills or York Mills Subway Line","Leslie Street Bus","Highway 401 & DVP","Shops at Don Mills – Fall 2008","York Mills Garden Plaza","Bayview Village Shopping Centre","Fairview Mall","Edwards Gardens","Bond Park","North York General Hospital"]
["km000011","ARCHIVE","Family Residential",154,"Three Valleys Drive",419900,null,"Great Potential in this Spacious Bungalow!","Ravine Property! Finished Lower Level with Seperate Entrance!","YORK MILLS/DON MILLS",null,null,43.745838999999997,-79.336996999999997,null,null,null,null,"36 x 123 FEET","$3,317.56/2007","4+1","3 Car Parking","1 X 4, 1 X3 PC",null,null,"IMMEDIATE/TBA",null,null,null,"Ravine Property","Roof ‘03’","100 Amp Service","Furnace ‘97’","Central Air Conditioning ‘97’","Hardwood Flooring Throughout","Mostly Updated Windows","Exterior","3 car parking","2 Garden sheds","Mature trees and shrubs","Backs on to ravine"]
["km000012","ARCHIVE","Condo",18,"Concorde #727",399900,null,"Wonderful 1680 sq.ft. Low Rise Condo Surrounded by Nature!!","Rare Model with Seperate Dining Room & Den!","CONCORDE/DVP",null,null,43.730097000000001,-79.328433000000004,null,null,null,null,null,"$3,019.07 / 2007",2,"2 underground spots","1 x 3, 1 X 5","$1,095.53 includes heat, cable, building insurance, common elements, water, hydro, central air conditioning and parking","1 Double size","Immediate",null,null,null,"FOYER ","Double mirrored closet","Marble flooring","Crown moulding","KITCHEN ","Ceramic tile backsplash","Pot lights","Ceramic tile flooring","Double sink","Garborator","Built-in dishwasher","Walkout to balcony","Built-in fridge","Sliding door to den","Kitchen bar","LIVING ROOM ","Oak hardwood flooring","Gas fireplace with marble surround","Walkout to balcony/ravine views","Separate thermostat","Crown moulding","DINING ROOM ","French doors","Oak hardwood floors","Wainscoting","Swing door to kitchen","Overlooks ravine","Crown moulding","MASTER ","Walk-in closet with built in shelving","Broadloom","Overlooks ravine","Ceiling fan","California shutters","Separate thermostat","5 PIECE ENSUITE BATHROOM","His and Her sinks","Whirlpool tub","Marble flooring and walls","Heat light","AMENITIES","Pool","Exercise room","Library","Party Room/Concorde Room","Card Room","Billiard Room","Spa/Hot Tub","Tennis Court","Putting Green","Car Wash Bay","Sun Deck"]
["km000013","ARCHIVE","Executive",16,"Kellythorne",799900,null,"Wonderful Executive Family Home!","On A Sought After Street And In A Demand Neighbourhood!","UNDERHIL/LAWRENCE",null,null,43.750408,-79.326830999999999,null,null,null,null,"48.5 x 129.88 Feet","$4,247.16/2007",5,"4 Car Parking + 2 Car Garage","1 x 5, 1 x 3, 1 x 2",null,null,"30/60/TBA",null,null,null,"New Driveway 2 1/2 wide fits 3 cars","Auto Garage Opener + 3 Remotes","New Windows Throughout – Oct ‘07’   ","100 Amp Service                  ","Furnace ‘05’","CAC ‘05’","Roof ‘06’","New Steel Side Door","Freshly Painted Throughout","2 Stairwells to the Lower Level","4 Fireplaces","EXTERIOR","Covered deck","Stone patio","Fully fenced"]
["km000014","ARCHIVE","Luxury",10,"Craigmont",829900,null,"Stunning Kitchen! Beautiful Koi Pond Overlooks Ravine","Gorgeous Hardwood Throughout! You Will Never Want to Leave the Luxurious Master Ensuite!","BAYVIEW/CUMMER",null,null,43.795988999999999,-79.377416999999994,"http://tours.advirtours.com/tours/10/69/106917/uindex.html",null,null,null,"71.13 x Irregular Ravine Lot","$4,724.75/2007","4+1","Attached Double Garage + 2 Car Parking","1x6, 1x4, 2x2 PC",null,null,"90 Days or TBA","Pineway Public School","Zion Heights Junior High School","A.Y. Jackson Secondary School","Ravine Lot","Koi Pond","New Exterior Awning","New Kitchen ‘02’","New 100 Amp Service","New 6 Piece Ensuite ‘07’","EXTERIOR","Double car garage + 2 car parking","Flagstone pathway","Veranda","Private ravine lot","Mature trees & shrubs","Koi Pond","New manual awning","Wooden deck"]
["km000015","ARCHIVE","Luxury",10,"Olsen",949900,null,"Gorgeous & Updated Family Home!","Top Notch Landscaping Including In-Ground Salt Water Pool with Remote Lighting!","DON MILLS/YORK MILLS",null,null,43.759853,-79.342808000000005,"http://tours.advirtours.com/tours/10/71/107179/uindex.html",null,null,null,"62.5 X 120 FT","$4,230.10/2007","4+1","Attached Double Garage + 4 Car Parking","2x4, 1x3, 1x2 PC",null,null,"June 30 2008 or TBA",null,null,null,"100 Amp Service","New Kitchen ‘08’","Three Walks-Outs to Back Garden!","Custom In-ground Salt Water Vinyl Pool","Professionally Landscaped ’06’ & ‘07’","Furnace ‘02’","Roof Re-Shingled ‘05’","Mostly Updated Windows","Updated Bathrooms","Two Wood Burning Fireplaces","Central Air Conditioning","Central Vacuum","EXTERIOR","4 car parking","Double car garage with built-in storage","Interlocking brick walkway ‘07’","Veranda with access to Mud Room entrance","Professionally landscaped front and back gardens ‘06’","Eon & Cedar decking with wrought iron spiral staircase ‘06’","Gas BBQ hookup","Backyard interlocking brick pathway ‘06’","Pool fencing ‘06’","Custom Lido in-ground salt water vinyl pool with remote lighting","Custom Armor stone jumping block with built-in waterfall","Custom British Columbia Cedar Lanai ‘06’","Armor stone retaining wall with built-in Cedar flower boxes","Wooden fencing around whole yard ‘06’","Custom professional walkway at side of house ‘06’","Custom Cedar Cabana with electricity, Monster Cable speaker wiring and frosted windows ‘06’","Rear garden area was professionally landscaped ’07"]
["km000016","ARCHIVE","Family Residential",89,"Three Valleys Drive",619900,null,"Re-Finished Hardwood! Steps to Donalda Golf Course!","Great Family Home on Sought After Street!","DON MILLS/YORK MILLS",null,null,43.749288999999997,-79.338389000000006,"http://tours.advirtours.com/tours/10/70/107060/uindex.html",null,null,null,"60 X 110 FT","$4,255.68/2007",4,"Attached Single Garage + 3 Car Parking","2x4 PC",null,null,"June 2008 or TBA",null,null,null,"Donlada Golf Club","Three Valleys Public School","Milne Valley Middle School","Minutes to DVP & HWY 401","Steps to TTC","EXTERIOR","P-shaped driveway with 3 car parking","Single garage","Flagstone steps","Two Flagstone patios in back garden","In-ground concrete pool","Fully fenced backyard"]
["km000017","ARCHIVE","Family Residential",2,"Donmac Drive",599900,null,"Large Family Home in The Heart of Don Mills!","Large Family Sized Eat-In Kitchen!","LESLIE/LAWRENCE",null,null,43.745168999999997,-79.358186000000003,"http://tours.advirtours.com/tours/10/70/107061/uindex.html",null,null,null,"59.14 x 122.76 FT","$3,300.50/2007",4,"Attached Single Garage + 2 Car Parking","1x4, 1x2 PC",null,null,"90 Days or TBA",null,null,null,"100 Amp Service","All New Windows","Hardwood Flooring Throughout","Steps to TTC, Highway 401 & DVP","EXTERIOR","Single car garage","2 car parking","Professionally landscaped front & back gardens","Interlocking brick walkway","Fully fenced back garden","Stone patio","Wooden deck"]
["km000018","ARCHIVE","Family Residential",11,"Broadleaf",499900,null,"Family Friendly Street in the Heart of Don Mills!","Great Potential! Hardwood Under Broadloom!","DON MILLS/LAWRENCE",null,null,43.739835999999997,-79.340363999999994,null,null,null,null,"60 x 100.92 FT","$3,257.86/2007",3,"4 Car Parking","1x4",null,null,"June 15/TBA",null,null,null,"IN YOUR NEIGHBOURHOOD","The New Shops at Don Mills","Moccasin Trail Park","St. Bonaventure Catholic School","Norman Ingram Elementary School","Don Mills Collegiate Institute","Donalda Golf and Country Club","Don Mills Arena","TTC & DVP","SPECIAL FEATURES","Roof '00'","Furnace '03'","Chimney Relined '94'","Hanover Kitchen '73'","100 AMP Service","Repla Windows"]
["km000019","ARCHIVE","Condo",50,"Three Valleys Drive #2",259900,null,"Commuter's Paradise! Large Unit!","Steps to schools, parks, TTC & DVP!","DON MILLS/YORK MILLS",null,null,43.7517,-79.335103000000004,null,null,null,null,null,"$1,876.26 /2007",3,"1 Spot (#52)","1x4","$345 (includes building insurance, common elements, water, and cable, parking)",null,"90 Days or TBA",null,null,null,"Furnace ‘03’","Central Air Conditioning ‘03’","EXTERIOR","Patio","Overlooks courtyard","IN YOUR NEIGHBOURHOOD","Donlada Golf Club","Three Valleys Public School","Milne Valley Middle School","Minutes to DVP & HWY 401","Steps to TTC"]
["km000021","ARCHIVE","Executive",6,"Kellythorne",739900,null,"Spacious Family Home!","Super Home with Many Upgrades!","UNDERHILL/LAWRENCE",null,null,43.750335999999997,-79.326460999999995,"http://tours.advirtours.com/tours/10/74/107421/uindex.html",null,null,null,"52 x 120 Feet Backing onto Park","$4247.16/2007","5+","2 Car Parking + Double Car Garage","1x5, 1x4, 1x2 & RI",null,null,"June 2008/TBA",null,null,null,"Backs onto Park","In ground Pool","In ground Sprinkler System","Interlocking Stone Pathway","Furnace 1 yr","Cac 1 yr","April Air Humidifier","Heba Filter","32 Windows Replaced + 4 Screen Doors","Roof Aprox. 8 yrs","2 Stairwells to Lower Level","100 amps CB  Roof  aprox. 8 years","EXTERIOR","Stone Front","Aluminum Soffit & Fascia","Entertainment Size Deck with underneath storage","Professionally landscaped","Repaved Driveway","New 1 inch water service.","Double Garage"]
["km000022","ARCHIVE","Family Residential",324,"Woodsworth Road",439900,null,"Great Family Home with Walk-out Lower Level!","Prime Don Mills Location!","LESLIE/BANNATYNE",null,null,43.763714,-79.364592000000002,null,null,null,null,"30.10 X 149.81 Feet","$2,532.94/2007",4,"3 Car Parking","2x4",null,null,"90 Days or TBA"]
["km000023","SOLD","Family Residential",12,"Kestell Lane",669900,null,"Ravine Lot in Prime Donalda Golf Club Location!","Gorgeous Ravine Lot on Quiet Cul-de-Sac!","DON MILLS/YORK MILLS",null,null,43.749555999999998,-79.339438999999999,null,null,null,null,"50 x 106.35 Feet","$4,810.03/2007","3+1","Single Car Garage + 2 Car Parking","1x4, 1x3",null,null,"60 Days or TBA",null,null,null,"Ravine Lot with Table Land","Furnace '02'","Central Air Conditioning '98'","100 Amp Service","Two Updated Bathrooms","All Windows Updated '98'","EXTERIOR","Single car garage","2 car parking","Professionally landscaped gardens","Ravine","Table land","Interlocking brick patio","Stone patio"]
["km000024","ARCHIVE","Luxury",18,"Salvi Court",999800,null,"Breath Taking Ravine Views! Lots of Table Land!","Stunning & Spacious Home! Totally Renovated with 4 Walk-outs!","VICTORIA VILLAGE",null,null,43.731518999999999,-79.317218999999994,"http://tours.advirtours.com/107883P",null,null,null,"44.09x120 Feet","$5,262.04/2008","4+1","Double Car Garage + 4 Car Parking","2x2, 2x3",null,null,"90 Days or TBA",null,null,null,"Approx. ½ acre on ravine","Totally renovated since 1999:                      *","Roof                                                             ","Siding","Mostly new windows and doors","Gas hook up to BBQ                                    ","200 Amps service","Furnace","Central Air","Humidifier","1100 sf of multi tier decking with attached, screened gazebo","Exterior window awning","Exterior deck awning with remote","100 feet of retaining wall","Jatoba Brazilian Cherry wood floors with Maple insert"]
["km000025","ARCHIVE","Renovator",3,"Massey Square #1902",95900,null,"Steps to the Danforth!","Great Potential!  ","DANFORTH/VICTORIA PARK",null,null,43.696156000000002,-79.295006000000001,null,null,null,null,null,"$1,031.94/2007",1,null,"1x4","$377.72 (includes: water, heat, hydro, cable, common elements & building insurance)",null,"30 Days or TBA",null,null,null,null,"AMENITIES: Exercise Room, Indoor Pool, Recreation Room, Sauna, Security Gaurd, and Security System"]
["km000026","ARCHIVE","Renovator",205,"Coxwell Avenue",249900,null,"Attention First Time Buyers and Renovators!","Super Potential in Prime Location!","COXWELL/GERRARD",null,null,43.671703000000001,-79.318753000000001,null,null,null,null,"19.5x90 Feet","$1,628.93/2007",2,null,"1x4",null,null,"30 Days or TBA"]
["km000027","ARCHIVE","Renovator",13,"Alton Avenue",269000,null,"Prime Location! Steps to the Beach!","Location! Location! Location!","QUEEN/LESLIE"," 43°39'50.79\"N"," 79°19'40.80\"W",43.664236000000002,-79.328050000000005,null,null,null,null,"15.83x108.67 Feet","$2,132.11/2008",3,null,"1x3, 1x2",null,null,"30 Days or TBA"]
["km000028","ARCHIVE","Renovator",4,"Dunkirk Road",319900,null,"Great Starter Home!","Steps to shops on the Danforth!","MORTIMER/COXWELL",null,null,43.691381,-79.323350000000005,null,null,null,null,"34.25 x 102.91 Feet","$2,430.61/2007",2,"3 Car Parking","1x4",null,null,"30 Days or TBA"]
["km000029","ARCHIVE","Family Residential",199,"Cassandra ",539900,null,"Wonderful Family Home Renovated to the Ninth Degree!","Gorgeous Hardwood, New Ceramic & Broadloom!","LAWRENCE/UNDERHILL",null,null,43.753982999999998,-79.321196999999998,null,null,null,null,"58 X 120 Feet","$3,334.62/2007",4,"Single Car Garage + 2 Car Parking","1x4, 1x2",null,null,"Immediate",null,null,null,"Freshly Painted Throughout","Furnace ‘07’","Central Air Conditioning","New Front Door","New Windows","All Hardwood Flooring Re-Finished","New Garage Door","Aluminum soffits and fascia"]
["km000030","ARCHIVE","Family Residential",49,"Ternhill",699900,null,"Gorgeous Renovated Home in the Heart of Don Mills!","Large Family Sized Lot!","DON MILLS/LAWRENCE",null,null,43.734499999999997,-79.353311000000005,"http://tours.advirtours.com/107570P ",null,null,null,"54.21 x 155.10 Feet (irregular)","$ 4,485.95/2008","3+2","Single Garage + 2 Car Parking",": 1x4, 1x3 ",null,null,"60 Days/TBA",null,null,null,"Beautifully Renovated Throughout","Lower Level Walkout & High Windows","New Kitchen ’03’","New Bathrooms ’03’ & ‘04’","Hardwood Floors New & Refinished","Lower Level All Renovated","100 Amp Service","Newer Roof  (Approximately ’01’)","Aluminum Soffits & Eaves","Mostly Updated Windows","High Efficiency Furnace ‘03’","Studio ","Central Air Conditioning‘99’","Professionally Landscaped Front & Back Gardens"]
["km000031","ARCHIVE","Family Residential",6,"Salvi Court",669900,null,"Ravine Lot with Lots of Useable Table Land!","Updated & on a Beautiful Nature Filled Lot!","VICTORIA VILLAGE"," 43°43'53.96\"N"," 79°19'1.15\"W",43.731603,-79.316719000000006,"http://tours.advirtours.com/107571P ",null,null,null,"65.68 x 198.58 Irregular Ravine Lot","$4,444.61/2008","3+2","Double Car Garage + 6 Car Parking","2x4, 1x2",null,null,"60 Days/TBA","Sloane Public School","Milne Valley Middle School","Victoria Park Collegiate Institute","Large Useable Table Land","200 Amp Service"," High Efficiency Furnace ‘05’","Central Air Conditioning ‘05’","Most Windows ‘02’","All New Doors on Main Floor","New Bathrooms","New Lower Level","Aluminum Soffits & Fascia","New Water, Gas, Telephone Lines","Additional New Insulation in Attic"]
["km000032","ARCHIVE","Family Residential",44,"Agincourt",699900,null,"Country Living in The City!","Private Tennis Court! Large Updated Family Home!","SHEPPARD AVE. EAST/KENNEDY",null,null,43.787275000000001,-79.283591999999999,"http://tours.advirtours.com/107834P",null,null,null,"75 x 245 Feet","$4,016.90/2007","4+1","Double Car Garage + 6 Car Parking","1x6, 2x4, 1x2",null,null,"60 Days/Flexible",null,null,null,"Private Fenced-in Tennis Court","Built by the President of Cadillac Fairview","Roof ‘00’","Pella Windows","Professionally Landscaped Front & Back Yards","Temperature Controlled Wine Room","¾” water service","Furnace Rebuilt in ‘04’","Central Air Conditioning ‘07’","200 Amp Service","Central Vacuum"]
["km000033","ARCHIVE","Condo",18,"Concorde Place #206",379900,null,"Ravine & Garden Views!","Best Floor Plan/Layout in the Building!","CONCORDE/DVP",null,null,43.730097000000001,-79.328433000000004,null,null,null,null,null,"$2857.03/2007",2,"2 Parking Spots (P211 & P263)","1x5, 1x3, 1x2 PC","$866.29/MO (Includes: water, hydro, heat, parking, central air conditioning, building insurance & common elements)",1,"60 Days/TBA",null,null,null,"Amenities:","Pool","Exercise room","Library","Party Room/Concorde Room","Card Room","Billiard Room","Spa/Hot Tub","Tennis Court","Putting Green","Car Wash Bay","Sun Deck"]
["km000034","ARCHIVE","Family Residential",27,"Medhurst",389900,null,"Super Starter Home on Ravine Lot!","Large Lot with Huge Deck & Exterior Fireplace!","VICTORIA PARK/ST.CLAIR",null,null,43.700211000000003,-79.294141999999994,null,null,null,null,"40 x 127 Feet","$2,302.67/2007","2+1","4 Car Parking","1x4, 1x3",null,null,"Aug 15 or TBA",null,null,null,"Ravine Lot","200 Amp Service","Central Vacuum","Central Air Conditioning","Roof Re-Shingled"]
["km000035","ARCHIVE","Luxury",2,"Brian Cliff",1247700,null,"Country Manor Steps to Edwards Gardens!","Three Stories of Pure Luxury! Prime Ravine Lot!","LESLIE/LAWRENCE",null,null,43.734375,-79.361028000000005,"http://tours.advirtours.com/108167P",null,null,null,"83 X 280 Feet","$6,592.42/2007",5,"Single Car Garage + 5 Car Parking","1x6, 1x4, 2x3, 1x2 pc",null,null,"90 Days or TBA",null,null,null,"New Air Conditioning System","New Furnace","Complete Renovation in 2003","Backs onto a Lush Ravine & Wilket Creek","Overlooks Edwards Gardens","Main Floor Family Room","Main Floor Music Room","New Oak Hardwood Flooring","Skylights","New Kitchen & Appliances","Windows Updated","New Bathrooms","New Gas Fireplace","2 Decks Overlooking Ravine"]
["km000036","ARCHIVE","Executive",38,"Lacewood",879900,null,"Super Sized Ravine Lot!","Sun Filled Family Room Overlooks Ravine!","DON MILLS/YORK MILLS",null,null,43.749183000000002,-79.335558000000006,"http://tours.advirtours.com/108114P",null,null,null,"46 x 172 Feet (Ravine)","$5,347.33/2007","2008-03-01","Single Car Garage + 6 Car Parking","1x4, 1x3",null,null,"60 Days/TBA",null,null,null,"Huge Ravine Lot","Lots of Tableland","New windows","New Kitchen","New Bathrooms","New Landscaping","New Main Floor Family Room","Interlocking brick pathway & patio","New fully fenced yard","Fountain","Lime stone patio","Ravine & golf course views","Custom playscape","Hot tub"]
["km000037","ARCHIVE","Family Residential",31,"Harris Park",349900,null,"Attention First Time Buyers! Great Starter Home!","Private Sun Deck!","VICTORIA PARK/EGLINTON",null,null,43.719760999999998,-79.297624999999996,null,null,null,null,"43 x 125 Feet","$2,532.94/2007","3+1","Single Car Garage + 3 Car Parking","1 x 4, 1 x 3",null,null," Aug. 2008/TBA",null,null,null,"In Your Neighbourhood:","O’Connor Community Centre","Edge Park","Clairlea Public School","Dentonia Park Golf Course","Dentonia Park Tennis Club","Steps to TTC & Subway","Eglinton Town Centre"]
["km000038","ARCHIVE","Renovator",109,"Linsmore",349900,null,"Location! Location! Location! Steps to the Danforth!","Great Opportunity to Get In To Hot Market!","DANFORTH/GREENWOOD",null,null,43.686042,-79.331483000000006,null,null,null,null,"20.71 x 100 Feet","$2,575.58/2008",3,null,"1 x 3",null,null,"30 Days/TBA"]
["km000039","ARCHIVE","Luxury",16,"Wetherfield",1488800,null,"Sought After Street in Family Friendly Neighbourhood!","Large Executive Family Home with All The Bells & Whistles! ","BANBURY/GREENGATE",null,null,43.739452999999997,-79.364756,"http://tours.advirtours.com/108219P",null,null,null,"70 x 110.11 Feet","$10,694.65/2007","4+1","Double Car Garage + 5-6 Car Parking","2x5, 1x4, 1x2",null,null,"90 Days/TBA",null,null,null,"200 Amp Service","Underground Sprinkler System in Front, Side & Back Yards ‘04’","Automatic Garden Lighting ‘04’","All New Broadloom Throughout ‘08’","New Roof Certainteed Triple Ply ‘04’","New over $200,000 in Landscaping & Outdoor Living Spaces ‘04’","New Pool Liner ‘06’","New Pool Pump & Heater ‘05’","New Windows & Doors ‘07’"]
["km000100","SOLD","Family Residential",233,"Belsize",699900,null,"Eco Friendly Home! Totally Reno'd From Top to Bottom '07'!","Izukawa Design! Large Backyard! Private Driveway!","MT. PLEASANT/BELSIZE",null,null,43.702883,-79.385756000000001,null,null,null,null,"26.5 x 125 Feey","$3,982.77/2007",3,"Private Driveway + 1 Car Parking","1x4, 1x3",null,null,"60 Days/TBA",null,null,null,"Totally Renovated ‘07’","In-Floor Radiant Heating ‘07’","Rinnai Tankless Water Heater ‘07’","100 Amp Service","Pressure Balanced Taps Throughout ‘07’","LG Ceiling Cassette 4-Way 2 Ton Ductless Air Conditioning System with Remote ‘07’","All New Plumbing & Drains ‘07’","Bamboo Flooring ‘07’","All New Electrical Wiring ‘07’","All New Windows & Exterior Doors ‘07’","All Interior Doors are New & Solid-Core"]
["km000101","ARCHIVE","Family Residential",324,"Logan Avenue",599900,null,"Steps to Queen Street & Danforth Shops!","Super Spacious Semi with Private Backyard!","QUEEN ST. EAST/LOGAN",null,null,43.662536000000003,-79.343328,null,null,null,null,"18.58 x 115 Feet","$3,123.47/2008",3,"1.5 Garage + 1 Laneway Parking Spot","1x4, 1x3",null,null,"60 Days/TBA",null,null,null,"All New Drains ‘04’","All New Interior Weeping Tiles ‘04’","Dug Out Lower Level ‘04’","100 Amp Service ‘04’","Mostly New Windows ‘00’ & ‘03’","Downspouts & Aluminum Fascia ‘01’","All New Interior Trim & Baseboards ‘02’ & ‘07’","Freshly Painted Throughout","Furnace ‘97’","Roof ‘05’","Central Air Conditioning System ‘05’","Two Updated Bathrooms","Newly Landscaped ‘08’"]
["km000102","SOLD","Luxury",15,"Brushwood",1098000,null,"Renovated, Updated and Ready for You to Enjoy!","Super Ravine Lot with Newly Landscaped Gardens, Inground Pool & Hydropool Hot Tub!","BROOKBANKS/UNDERHILL",null,null,43.754961000000002,-79.328022000000004,"http://tours.advirtours.com/108443P",null,null,null,"65.38 x 127.75 Feet (Ravine Lot)","$6,369.44/2008",5,"Double Car Garage + 4 Car Parking","1x6, 1x5, 3x2, 1x1",null,null,"Sept/Oct.2008/TBA",null,null,null,"Ravine Lot","Located on Quiet Court","All Windows are Boeville Wood Windows with Aluminum Clad Outside Outside, Energy Star, Low E, Argon‘05’","New Professionally Landscaped Gardens","Roofs ‘03’ & ‘04’","200 Amp Service","Hydro Pool Inground Salt Water Hot Tub","Inground Concrete Pool with Custom Diving Rock & New Interlocking Stone ‘07’"]
["km000103","ARCHIVE","Family Residential",462,"Huntingwood Drive",399900,null,"Super Opportunity in this Spacious Bungalow!","Beautifully Landscaped Back Garden with Raised Wooden Deck & Inground Pool!","WARDEN/SHEPPARD AVE. EAST",null,null,43.784146999999997,-79.316269000000005,null,null,null,null,"43.92 x 135 Feet (As Per Survey)\n","$2,839.96/2007",3,"Single Car Garage + 2 Car Parking","1x5, 1x2",null,null,"Immediate/TBA",null,null,null,"Roof ‘06’","100 Amp Circuit Breakers","Hardwood Under Broadloom","Beautifully Landscaped Private Back Garden with Inground Pool"]
["km000104","ARCHIVE","Condo",131,"Beecroft Road #1401",539900,null,"Panoramic Views from Totally Renovated Condo!","Prestigious Manhatten Place 2 Bedroom Condo Steps to All Amenities!","YONGE/SHEPPARD",null,null,43.764474999999997,-79.414558,null,null,null,null,null,"$2,957.24/2008",2,"1 Owned Parking Spot","1x4, 1x3","$884.96/mo (includes heat, hydro, water, central air conditioning, parking, insurance, cable and common elements)",121,"Oct/Nov 2008",null,null,null,"Panoramic Views From Every Window","Totally Renovated ‘00’","In-Floor Heating in Kitchen ‘00’","Sensored Lighting in Front Hall & Laundry Room","Valet Parking","Ensuite Security Alarm","Ensuite Laundry Room","FACILITIES: "," Saunas","Terraced Sun Deck","Recreation Room with Pingpong and Billiards","Exercise Room, Hobby Room,","Indoor Pool,","Squash/Racketball Court","Library and Party Lounge with Wet Bar"]
["km000105","ARCHIVE","Family Residential",6,"Donewen Court",479900,null,"Quiet Cul-de-Sac Living in this Spacious Updated Home!","Hardwood Flooring, New Broadloom, New Kitchen! Move-in & Enjoy!","VICTORIA VILLAGE",null,null,43.732216999999999,-79.315263999999999,null,null,null,null,"55 x 89 Feet Pie Shaped Lot ","$3,539.30/2007",3,"Single Car Garage + 4 Car Parking","1x4, 1x2",null,null,"60 Days/TBA",null,null,null,"Kitchen ‘04’","Mostly Newer windows","Central Air Conditioning System ‘06’","100 Amp Service","In Your Neighbourhood:","Sloane Avenue Public School","Victoria Park Secondary School","Wigmore Park","The Charles Sauriol Conservation Area","Victoria Village Public Library","Sweeney Drive & Sloane Avenue TTC Service","Eglinton Square Shopping Centre","Golden Mile Shopping Centre","Victoria Terrace Shopping Centre"]
["km000106","ARCHIVE","Condo",16,"Dallimore Circle #513",310000,null,"Amazing Tree Top Ravine Views!","Beautifully Upgraded 2+1 Condo!","DON MILLS/LAWRENCE",null,null,43.731008000000003,-79.334677999999997,null,null,null,null,null,"2064.46/2008",2,"1 Underground Spot #32","1x4, 1x3","$453.82 (includes, heat, water, central air conditioning, building insurance, common elements & parking)","1, #126","Sept 2008/TBA",null,null,null,"Engineered Hardwood Flooring (Jatoba Rainforest Cherry)","Upgraded Spot Lighting in Living Room","Upgraded Black Appliances","The Kitchen has Upgraded “Saratoga” Style Cabinets with Sharp Chrome Hardware","Granite Countertops","FACILITIES:","Hot Tub","Exercise Room","Party Room with Bar & Full Kitchen","Party Room has Large Terrace"]
["km000107","ARCHIVE","Family Residential",64,"Greenland Road",569900,null,"Live in the Heart of Don Mills! Steps to TTC, DVP & The New Shops at Don Mills!","Updated Bungalow in Move-in Condition!","DON MILLS/LAWRENCE",null,null,43.737067000000003,-79.337824999999995,null,null,null,null,"64x110.25 Feet","$2,916.72/2007","3+2","4 Car Parking","1x4, 1x3",null,null,"30 Days/TBA","Greenland Public School, Norman Ingram Public School","Don Mills Middle School","Don Mills Collegiate Institute, Northern Secondary School","Roof ‘01’","Furnace ‘04’","Central Air Conditioning ‘04’","100 Amp Service","All Updated Windows","Two New Bathrooms","Eaves & Soffits ‘06’","Exterior Lighting ‘06’","Exterior Stucco ‘06’","Appliances ‘04’"]
["km000108","ARCHIVE","Family Residential",41,"Hatherton Crescent",579900,null,"Super Family Home in One of The Best Neighbourhoods!","Wonderfully Updated Throughout!","LAWRENCE/UNDERHILL"," 43°44'56.29\"N"," 79°19'21.70\"W",43.749208000000003,-79.322956000000005,null,null,null,null,"50 x 115.13 Feet","$3,650.16/2007","3+1","Single Car Garage + 2 Car Parking","1x4, 2x3, 1x2",null,null,"60 Days/TBA","Ranchdale Public School","Milne Valley Middle School","Victoria Park Collegiate Institute","In Your Neighbourhoud:","Minutes to The New Shops at Don Mills","Short walk to Donwoods Plaza","Donalda Golf and Country Club","Broadlands Community Centre with Pool & Ice Rink","Broadlands Public School (Fr. Immersion)","Cassandra Public School","Ranchdale Public School","Milne Valley Middle School","Victoria Park High School","Crestwood Preparatory College","Senator O’Connor High School","TTC, DVP & Highway 401"]
["km000109","ARCHIVE","Family Residential",27,"Berkinshaw Crescent",589900,null,"Gorgeous Sidesplit, Renovated with Kitchen Addition!","Enjoy the Spa-Like Back Garden With Inground Pool!","LAWRENCE/DON MILLS",null,null,43.742396999999997,-79.348425000000006,null,null,null,null,"60 x 100 Feet","$3,657.18/2008",3,"Carport + 4 Car Parking","1x4, 1x3, 1x2",null,null,"Sept 1/08 or TBA",null,null,null,"In Your Neighbourhood:","Bond Park","Edwards Gardens","Don Mills Civitan Arena","Don Mills Public Library","The New Shops at Don Mills (Coming Soon)","Greenland Public School","Norman Ingram Public School","Don Mills Middle School","St. Bonaventure Catholic School","Bayview Glen Private School","TTC, DVP & Highway 401"]
["km000110","ARCHIVE","Family Residential",337,"Dawes Road",379900,null,"Modern Charmer with Skylights, Finished Lower Level & Private Garden Oasis!","Overlooks Donora Park & Sides Taylor Creek Park!","DONORA/DAWES"," 43°41'58.28\"N"," 79°17'47.15\"W",43.699632999999999,-79.296402999999998,null,null,null,null,"40 x 115.75 Feet","$2,091.07/2008","2+1","Detached Garage","1x4, 1x3",null,null,"30 Days/TBA","Secord Public School","D.A. Morrison Middle School","East York Collegiate Institute, Eastern Commerce Collegiate Institute, Danforth Tech","In Your Neighbourhood:","Taylor Creek Park & Donoara Park","Walking Trails","TTC & Subway","Steps to Shops on the Danforth","Dentonia Golf Club"]
["km000111","ARCHIVE","Family Residential",18,"King Richard Court",349900,null,"Super Location! Amazing Lot!","Commuters Paradise! Great Starter Home!","HWY 7/MAIN STREET",null,null,43.870525000000001,-79.274225000000001,null,null,null,null,"60 x 150 Feet","$2,618.22/2007","3+1","3 Car Parking","1x4, 1x2",null,null,"Immediate/TBA",null,null,null,"High Efficiency Furnace ‘06’","Stripped & Re-Shingled Roof ‘05’","100 Amp Service","Aluminum Soffits & Fascia","Most Rooms Freshly Painted ‘08’"]
["km000112","ARCHIVE","Family Residential",5,"Shamokin Drive",728800,null,"New Kitchen! Gorgeous Hardwood Flooring! 3 Walk-outs!","Private Fully Fenced Backyard FeaturesCalming Inground Pool!","DON MILLS/YORK MILLS",null,null,43.759138999999998,-79.342641999999998,null,null,null,null,"68x113.83 Feet","$4,680.84/2008","3+1","Double Car Garage + 4 Car Parking","1x4, 2x3",null,null,"90 Days/TBA",null,null,null,"Stucco Front Facing ‘03’","2 Additions ‘03’","Canac Kitchen with Granite Countertops ‘03’","3 New Bathrooms ‘03’","Main Hallway & Foyer Extended ‘03’","Hardwood Flooring Throughout ‘03’","Italian Limestone Flooring ‘03’","2 Fireplaces","Roof ‘03’","Central Air Conditioning System ‘03’","Central Vacuum ‘03’ ","California Shutters '08' "]
["km000113","SOLD","Family Residential",10,"Yewfield Crescent",629900,null,"Don Mills Family Home with Lovely Mature Garden!","Located on Sought After Street Steps to Donalda Golf Course, TTC & DVP!","DON MILLS/LAWRENCE"," 43°44'55.64\"N"," 79°20'44.93\"W",{"$f":"IF(ISBLANK(K55),\"\",DMS_to_Dec(K55))","v":43.748788888888889},{"$f":"IF(ISBLANK(L55),\"\",DMS_to_Dec(L55))","v":-79.345813888888884},"http://www.karenmillar.com/spotlight_slideshow.php?id=km000113",null,null,null," 60 x 117.25 Feet"," $3,889.29/2011"," 3+1"," Carport + 2 Car Parking"," 1x4, 1x3 Piece",null,null," 90-120 Days/TBA"," Greenland Public School, Norman Ingram Public School"," Don Mills Middle School"," Don Mills Collegiate Institute, Northern Secondary School"," In Your Neighbourhood:"," The New Shops at Don Mills"," St. Bonaventure Catholic School"," Norman Ingram Elementary School"," Don Mills Collegiate Institute"," Don Mills Public Library"," Civitan Don Mills Arena"," Donalda Golf and Country Club"," TTC & DVP"]
["km000114","ARCHIVE","Family Residential",16,"Wallingford Road",449900,null,"Great Opportunity to Live in One of Don Mills' Sought After Neighbourhoods!","Backs on to Greenbelt that Leads you to Walking Trails!","BROOKBANKS/UNDERHILL",null,null,43.755246999999997,-79.322002999999995,null,null,null,null,"60 x 120 Feet","$4,103.39/2008","3+2","Single Car Garage + 2 Car Parking","2x4",null,null,"30 Days/TBA",null,null,null,"Special Features","Walk-out Lower Level","2 Full Kitchens and 2 Full Baths","Needs Updating","Great Opportunity for Handy Folks and Renovators","Close to TTC, DVP & 401","Steps to Private/Public/Separate & French Immersion Schools"]
["km000115","ARCHIVE","Family Residential",48,"Shamokin Drive",669900,null,"Renovated, Spacious & Gorgeous in Sought After Donalda Neighbourhood!","Steps to schools, parks, TTC & DVP!","DON MILLS/YORK MILLS",null,null,43.761671999999997,-79.344614000000007,null,null,null,null,"56.36 x 110 Feet","$3,982.75/2008","4+1","Double Car Garage + 4 Car Parking","2x4, 1x3",null,null,"Immediate/TBA",null,null,null,"New Kitchen ‘03","All New Top of the Line Windows ‘08","All New Stainless Steel Appliances ‘03","Main Floor Family Room with Walk-Out","Roof ‘01","All New Bathrooms"]
["km000116","ARCHIVE","Family Residential",40,"Broadleaf Road",469900,null,"Great Location and Lot!","Attention Builder's & Renovator's!","DON MILLS/LAWRENCE",null,null,43.740436000000003,-79.337761,null,null,null,null,"80 x 100 Feet","$3,613.43/2008",3,"Carport + 2 Car Parking","1x4, 1x2",null,null,"Oct 2008/TBA","Greenland Public School, Norman Ingram Public School","Don Mills Middle School","Don Mills Collegiate Institute, Northern Secondary School","In Your Neighbourhood:","The New Shops at Don Mills","St. Bonaventure Catholic School","Norman Ingram Elementary School","Don Mills Collegiate Institute","Don Mills Public Library","Civitan Don Mills Arena","Donalda Golf and Country Club","TTC & DVP"]
["km000117","ARCHIVE","Family Residential",43,"Talwood Drive",599900,null,"Super Lot Backing on to Green Space & Walking Trails!","Great Opportunity in Don Mills!","LESLIE/LAWRENCE",null,null,43.740450000000003,-79.354305999999994,null,null,null,null,"54.76 x 130 (Per Survey)","$3,648.43/2008",3,"3 Car Parking","1x4, 1x1",null,null,"IMMEDIATE/TBA",null,null,null,"In Your Neighbourhood:","The New Shops at Don Mills","St. Bonaventure Catholic School","Norman Ingram Elementary School","Don Mills Collegiate Institute","Don Mills Public Library","Civitan Don Mills Arena","TTC, DVP & HWY 401"]
["km000118","ARCHIVE","Condo",260,"Merton Street #802",299900,null,"Live in Super Trendy Davisville! Steps to Shops, TTC & Subway!","Spacious Den can be Used as Second Bedroom!","MT. PLEASANT/MERTON"," 43°41'52.42\"N"," 79°23'17.83\"W",{"$f":"IF(ISBLANK(K60),\"\",DMS_to_Dec(K60))","v":43.697894444444444},{"$f":"IF(ISBLANK(L60),\"\",DMS_to_Dec(L60))","v":-79.388286111111114},null,null,null,null,null,"$1,942.33/2008","1+1","1 Underground Spot #16 (Lower Level)","1x4","$345.97/mo (includes: heat, hot water, common elements, building insurance & parking)","1 (#36 in P2)","30 Days/TBA",null,null,null,"Engineered Laurentian Maple & Walnut flooring ‘05","Full Duct Cleaning ‘08","Steps to Yonge Street & Mount Pleasant Shopping","TTC & Subway at your Doorstep","Facing Quiet Courtyard"]
["km000119","ARCHIVE","Family Residential",276,"Malvern Road",799000,null,"Completely Renovated One of A Kind Property in Quiet Area!","Open Concept with Individual Space!","LAKESHORE/WALKER'S LINE",null,null,"","","http://www.venturehomes.ca/VirtualTour.asp?tourid=12403",null,null,null,"72 X 113 FEET","$3,803/2007",3,"Single Garage + 2 Car Parking","2x4, 1x3, 1x2 PC",null,null,"Immediate",null,null,null,"Professionally Decorated","Hardwood flooring Throughout","Beautifully Landscaped Private Back Garden with Interlocking Patio","All New Bathrooms","Cozy Wood Burning Fireplace","Main Floor Laundry Room","Fully Finished Basement"]
["km000120","ARCHIVE","Family Residential",37,"Cardiff Road",529900,null,"Super Location!  ","Great Opportunity for Builders & Renovators!","BAYVIEW/EGLINTON"," 43°42'41.06\"N"," 79°23'1.65\"W",43.711405555555558,-79.383791666666667,null,null,null,null,"25 x 107 Feet","$3,245.96/2008",2,"Private Driveway + 2 Car Parking","1x4",null,null,"30 Days/TBA","Eglinton Junior Public School","Hodgson Senior Public School","Northern Secondary School"]
["km000121","ARCHIVE","Family Residential",104,"Earlton Road",359900,null,"Huge Backyard & Very Private!","Perfect for Starter Home!","KENNEDY/SHEPPARD"," 43°46'41.74\"N"," 79°17'17.12\"W",43.778261111111107,-79.288088888888893,null,null,null,null,"59 x 200 Feet","$2,581.02/2008",2,"Single Garage + 2 Car Parking","1x4, 1x3",null,null,"30 Days/TBA","Inglewood Heights Junior Public School","John Buchan Senior Public School","Stephen Leacock Collegiate Institute, Sir William Osler High School"]
["km000122","ARCHIVE","Condo",7,"Concorde Place #1605",299900,null,"Sought After Building with Great Amenities!","Easy Access to DVP & 401!","CONCORDE/DVP"," 43°43'47.70\"N"," 79°19'39.86\"W",43.729916666666668,-79.327738888888888,null,null,null,null,null,"$2,336.04/2008","2+1","2 underground spots","1x5, 1x4",660.8,null,"31 Days/TBA"]
["km000123","ARCHIVE","Family Residential",42,"Ruscica Drive",449900,null,"Located in Beautiful Victoria Village! ","Spacious Family Home Steps to School, Parks & TTC!","VICTORIA VILLAGE"," 43°44'0.22\"N"," 79°18'36.76\"W",43.733394444444443,-79.310211111111101,null,null,null,null,"60 x 105 Feet","$3,499.69/2008",3,"Extra Large Garage + 2 Car Parking","1x4, 1x3",null,null,"32 Days/TBA","Sloane Public School","Milne Valley Middle School","Victoria Park Collegiate Institute","Hardwood Flooring Under Broadloom","Some Updated Windows","Super Spacious Eat-In Kitchen with Walk-out to Garden","Private Back Garden"]
["km000124","ARCHIVE","Executive",62,"Olsen Drive",799900,null,"Gorgeous Ravine Lot!","Beautifully Updated Executive Home!","DON MILLS/YORK MILLS"," 43°45'39.21\"N"," 79°20'45.05\"W",43.760891666666666,-79.345847222222218,null,null,null,null,"60 x 125.66 feet","$4,434.78/2008","3+2","Double Car Garage + 2 Car Parking","3x4, 1x2 pc",null,null,"33 Days/TBA","Rene Gordon Elementary School","Donview Middle School","George S. Henry Academy","Special Features","New Front Addition 2008","New Landscaping 2008","New Canopy 2008","Stucco 2008","Spacious and Funky Floorplan","In Your Neighbourhood:","New Shops at Don Mills","Brookbanks Public Library","Don Mills Public Library","Donalda Golf & Country Club","TTC, DVP & Highway 401","Fenside & Civitan Arenas"]
["km000125","ARCHIVE","Executive",11,"Shamokin Drive",799900,null,"In The Prestigious Donalda Golf & Country Club ","Beautiful Addition with Lots of Updates!","DON MILLS/YORK MILLS"," 43°45'33.64\"N"," 79°20'34.64\"W",43.759344444444444,-79.342955555555548,null,null,null,null,"73 x 105 Feet","$3,914.55/2008","5+3","Double Car Garage + 2 Car Parking","2x4, 1x3 Piece",null,null,"34 Days/TBA","Rene Gordon Elementary School","Donview Middle School","George S. Henry Academy","Kitchen '08","Refinished Hardwood '07 & New Hardwood '08","Updated Windows"]
["km000126","ARCHIVE","Family Residential",52,"Lacewood Crescent",549900,null,"Super Home in Great Donalda Golf Club Location!","Updated and Move-in Ready!","YORK MILLS/DONALDA"," 43°44'55.52\"N"," 79°20'14.51\"W",43.748755555555555,-79.337363888888888,null,null,null,null,"59.47 x 77 Feet","$4,190.88/2008","3+1","3 Car Parking","2x4, 1x2, ",null,null,"Immediate/TBA","Three Valleys Public School","Milne Valley Middle School","George S. Henry Academy","Roof ‘02","Furnace ‘00","Refinished Hardwood Flooring ‘08","200 Amp Service","Mostly New Windows","3 Fireplaces","Freshly Painted ‘08"]
["km000127","ARCHIVE","Family Residential",93,"Tulane Crescent",369900,null,"Super Sized Pie Shaped Lot!","Great Starter Home!","YORK MILLS/DVP"," 43°45'49.44\"N"," 79°19'26.92\"W",43.763733333333334,-79.324144444444443,null,null,null,null,"25.92 x 113 feet","$2,817.25/2008",3,"Carport + 3 Car Parking","1x3, 1x2 Piece",null,null,"36 Days/TBA","Fenside Public School","Donview Middle School","George S. Henry Academy","Stainless Steel Appliances","Hardwood Flooring","Bright Solarium with Walk-out to Back Garden","Main Floor Laundry Closet"]
["km000128","ARCHIVE","Condo",18,"William Carson",465500,null,"Spacious 2+1 Bedroom in Sought After Hogg's Hollow Location!","Lots of Bright Sunlight Through All Windows & Walk-out to Private Garden","YONGE/YORK MILLS"," 43°44'57.08\"N"," 79°24'25.05\"W",43.749188888888888,-79.406958333333336,null,null,null,null,null,"$3,307.21/2008","2+1","1 Uderground Spot (P1 #26)","1x5, 1x4","$724.61/mo (includes heat, hot water, hydro, central air conditioning, common elements, building insurance & parking)","1 (P1 # 127)","37 Days/TBA",null,null,null,"Amenities:","Party Room with Kitchen","Putting Green","Two Exercise Rooms","Media Room","Billiards Room","Indoor Pool","Two Guest Suites","Easy Access to TTC & Sybway","Steps to Yonge Street Shopping"]
["km000129","ARCHIVE","Family Residential",29,"Denrock Drive",659900,null,"Bayview Village Beauty!","Spacious Bungalow & Nicely Updated!","SHEPPARD & BURBANK"," 43°46'17.53\"N"," 79°22'34.04\"W",43.771536111111111,-79.376122222222222,null,null,null,null,"54.08 x 126 Feet","$4,619.59/2008","3+1","Double Car Garage + 2 Car Parking","1x4, 1x3, 1x2",null,null,"30 Days/TBA","Elkhorn Public School","Bayview Middle School","Earl Haig Secondary School","Updated Kitchen","Mostly Updated Windows","Hardwood Flooring","Walk-out to Raised Wooden Deck"]
["km000130","ARCHIVE","Family Residential",34,"Fairhill Crescent",449900,null,"Charming House with Amazing Potential!","Rare Center Hall Plan!","LAWRENCE/UNDERHILL"," 43°44'53.88\"N"," 79°19'13.96\"W",43.7483,-79.320544444444437,null,null,null,null,"55 x 109.93 Feet","$3,665.93/2008",3,"Single Car Garage + 3 Car Parking","1x4, 1x3, 1x2",null,null,"30 Days/TBA","Cassandra Public School & Ranchdale Public School","Milne Valley Middle School","Victoria Park Collegiate Institute","Hardwood Flooring Under Broadloom","Inground Concrete Pool","Centre Hall Plan with separate Dining Room","Walk-out Lower Level"]
["km000131","ARCHIVE","Condo",3830,"Bathurst Street #802",399900,null,"Penthouse! Rare, First Time Offered!","Spectacular Suite with Floor-to-Ceiling Windows Overlooking the City","BATHURST/WILSON"," 43°44'24.23\"N"," 79°26'5.53\"W",43.740063888888891,-79.434869444444445,"http://tours.advirtours.com/109686P",null,null,null,null,"$2,913.49/2008",3,"1 Underground Spot (Level A #40)","1x4, 1x 3 Piece","543.52mo/ (includes heat, water, central air conditioning, parking, building insurance & common elements)","1 (#40)","Nov.15 2008/TBA","Faywood Arts-Based Curriculum School","Dublin Heights E & MS/Faywood Arts-Based Curriculum School","Sir Sandford Fleming Academy","Close to Parking, Shopping, Dining & TTC Synagogues","Engineered Oak Flooring Throughout","Large Garage-Sized Locker with Built-in Custom Shelving","24 Hour Concierge/Security"]
["km000132","ARCHIVE","Family Residential",5,"Hemford Crescent",595500,null,"Funky 4 Bedroom in the Heart of Don Mills!","Spacious Home with Peaceful Garden! Access to Walking Trails!","DON MILLS/LAWRENCE"," 43°44'25.09\"N"," 79°21'5.49\"W",43.740302777777778,-79.351524999999995,null,null,null,null,"60 x 108.2","$3,727.17/2008",4,"2 Car Parking ","1x4, 1x3",null,null,"30 Days/TBA","Greenland Public School, Norman Ingram Public School","Don Mills Middle School","Don Mills Collegiate Institute, Northern Secondary School","In Your Neighbourhood:",null,"The New Shops at Don Mills","Bond Park","Don Mills Tennis Club","St. Bonaventure Catholic School","Norman Ingram Elementary School","Don Mills Collegiate Institute","Don Mills Public Library","Civitan Don Mills Arena","TTC, DVP & HWY 401"]
["km000133","ARCHIVE","Condo",28,"William Carson Crescent #204",439900,null,"Gorgeous Sun-Filled Suite on Sought After Hillside Residence!","Fully Loaded Luxurious 2+1 Bedroom Overlooking Courtyard! Lots of Upgrades!","YONGE/YORK MILLS"," 43°44'51.84\"N"," 79°24'22.92\"W",43.747733333333336,-79.406366666666671,null,null,null,null,null,"$2,729.76/2008","2+1","1 Uderground Spot (#93B)","1x4, 1x3","$571.67/mo includes heat,cable, hot water, hydro, central air conditioning, common elements, building insurance & parking)","1 (162B)","30 Days/TBA",null,null,null,"Amenities:","Party Room with Kitchen","Putting Green","Two Exercise Rooms","Media Room","Billiards Room","Indoor Pool","Two Guest Suites","Easy Access to TTC & Sybway","Steps to Yonge Street Shopping"]
["km000134","ARCHIVE","Luxury",28,"Yewfield Crescent",1175000,null,"This is a Wow! Modern Living in Super Spacious Home!","Gorgeous & Peacefull Ravine/Golf Course Lot!","DON MILLS/LAWRENCE"," 43°44'57.79\"N"," 79°20'41.05\"W",43.749386111111114,-79.344736111111104,"http://tours.advirtours.com/109804",null,null,null,"Front: 60’, Rear: 110’, North: 138’, South: 162’","$5,302.03/2008",4,"Single Car Garage + 2 Car Parking","1x6, 1x4, 1x3",null,null,"90 Days/TBA","Greenland Public School, Norman Ingram Public School","Don Mills Middle School","Don Mills Collegiate Institute, Northern Secondary School","3 Additions (2 were excavated down to lower level)","Renovated Lower Level ","Quiet Crescent with 110 Feet Backing onto Donalda Golf Club","Professional Lightscaping & Landscaping ","In-Ground Sprinkler System","200 Amps Circuit Breaker","Furnace’99 ","Central Air Conditioning System ","Remote Silhouette Hunter Douglas Blinds","Custom Tilt & Swing German Windows","Custom German Double Doors","2 Fireplaces ","Newer Electrical","Newer Plumbing   ","¾ inch water main + ¾ inch interior"]
["km000135","ARCHIVE","Family Residential",113,"Overland Drive",529900,null,"Gorgeous End Unit in Stunning Freehold Townhome!","Lots of Updates Including Hardwood Flooring Throughout!","DON MILLS/LAWRENCE"," 43°43'50.72\"N"," 79°21'5.45\"W",43.730755555555561,-79.351513888888888,null,null,null,null,"31.56 x 84.97 Feet","$3,761.03/2008",3,"Single Car Garage + 1 Car Parking","2x2, 1x2",null,null,"60-90 Days/TBA","Greenland Public School, Norman Ingram Public School","Don Mills Middle School","Don Mills Collegiate Institute, Northern Secondary School","Newer Townhome","End Unit","Complex is Approximately 8 Years Old","Central Vacuum","100 Amps Service","In-ground Sprinkler System","Steps to Edwards Gardens & Walking Trails","The New Shops at Don Mills","Don Mills Public Library","Civitan Don Mills Arena","Don Mills Tennis Club","Bond Park","TTC & DVP"]
["km000136","ARCHIVE","Family Residential",6,"Olsen Drive",null,3600,"Ravine-Like Views in Spacious & Updated!","Large Family Sized Eat-in Kitchen with Walk-out to Garden & 4 Skylights!","DON MILLS/YORK MILLS"," 43°45'35.05\"N"," 79°20'34.64\"W",43.75973611111111,-79.342955555555548,null,null,null,null,null,null,"3+2","Double Car Garage + 4 Car Parking","1x4, 2x3",null,null,"Immediate/TBA","Rene Gordon Elementary School","Donview Middle School","George S. Henry Academy","Bright Natural Sun Fillled Home with Lots of Skylights!","Hardwood Flooring Throughout!","Three Fireplaces with Stone Surround!","Three Walk-outs + Access to Garage through Kitchen!"]
["km000137","ARCHIVE","Family Residential",42,"Meighen Avenue",429999,null,"Super Large Home with Lovely Private Garden Backing on to Park!","Quiet Dead-End Street! Steps to Danforth Shopping, TTC & Subway!","DONORA/DAWES"," 43°42'0.00\"N"," 79°17'41.66\"W",43.7,-79.294905555555559,null,null,null,null,"66 x 110 Feet","$2,865.55/2008","3+1","Double Carport + 2 Car Parking","1x5, 1x4",null,null,"Immediate/TBA","Secord Public School","D.A. Morrison Middle School","East York Collegiate Institute, Eastern Commerce Collegiate Institute, Danforth Tech","In Your Neighbourhood:","Taylor Creek Park & Donoara Park","Walking Trails","TTC & Subway","Steps to Shops on the Danforth","Dentonia Golf Club"]
["km000138","ARCHIVE","Family Residential",8,"Ballyronan Road",499900,null,"Great Don Mills Opportunity!","Attention Builders/Renovators!","LESLIE/YORK MILLS"," 43°44'59.10\"N"," 79°21'29.65\"W",43.749749999999999,-79.358236111111111,null,null,null,null,"60 x 100 Feet","$3,429.70/2008",3,"4 Car Parking","1x4",null,null,"30 Days/TBA","Rippleton Public School","St. Andrews Public High School, Windfields Junior High School","York Mills Collegiate Institute, Northern Secondary School","St. Bonadventure Catholic School","GO Station","Don Mills or York Mills Subway Line","Leslie Street Bus","Highway 401 & DVP","Shops at Don Mills – Fall 2008","York Mills Garden Plaza","Bayview Village Shopping Centre","Edwards Gardens","Bond Park","North York General Hospital"]
["km000139","ARCHIVE","Family Residential",150,"Broadlands Boulevard",449900,1500,"Spacious Bungalow Steps to All Amenities!","Updated Family Sized Eat-in Kitchen Overlooks Back Garden!","LAWRENCE/UNDERHILL"," 43°44'50.56\"N"," 79°18'49.48\"W",43.747377777777778,-79.313744444444438,null,null,null,null,"60 x 100 Feet","$3,333.46/2008","3+2","2 Car Parking","1x4",null,null,"60 Days/TBA","Cassandra Public School & Ranchdale Public School","Milne Valley Middle School","Victoria Park Collegiate Institute","In Your Neighbourhood:","The New Shops at Don Mills","Donalda Golf and Country Club","Broadlands Community Centre","Broadlands Public School (Fr. Immersion)","Cassandra Public School","Ranchdale Public School","Milne Valley Middle School","Victoria Park High School","Crestwood Preparatory College","Senator O’Connor High School","TTC & DVP"]
["km000140","SOLD","Luxury",10,"Denlow Boulevard",949900,null,"Luxuriously Renovated Family Home in Prestigious Location!","Large Two Storey Executive Family Home! Renovated 2008!","LESLIE/YORK MILLS"," 43°44'45.51\"N"," 79°21'35.13\"W",43.745975000000001,-79.359758333333332,"http://www.Obeo.com/499748",null,null,null,"55 x 110 Feet","$6,946.89/2008","4+2","Double Car Garage + 2 Car Parking","1x5, 2x3 1x2",null,null,"60/90/TBA","Denlow Public School","Windfields Junior High School","York Mills Collegiate Institute, Northern Secondary School","Kitchen ‘08","Roof ‘04","Main Floor Hardwood Flooring ‘08","Main Floor Laundry Room ‘08","200 Amp Service","Three Walk-Outs!","Prime Denlow School Location!","The New Shops at Don Mills","Don Mills Public Library","Civitan Don Mills Arena","Donalda Golf and Country Club","Bond Park","Don Mills Tennis Club","TTC, DVP & Highway 401"]
["km000141","ARCHIVE","Family Residential",44,"Anaconda Avenue",269900,null,"Wonderful Home Updated Throughout","Steps to St. Clair","ST. CLAIR/BIRCHMOUNT"," 43°42'55.86\"N"," 79°16'26.14\"W",43.715516666666673,-79.273927777777772,null,null,null,null,"30 X 138 Feet","$1,968.58/2008",3,"3 Car Parking","1 x 4, 1 x 1 Piece",null,null,"Immediate/TBa","General Brock Public School","SATEC @ WA Porter Collegiate Institute","Maplewood High School","Bendale Business & Technology Institution",null,"Super Deep Lot","Private Garden Oasis","Porch '06","All Windows '07"]
["km000142","ARCHIVE","Family Residential",99,"Wyndcliff Crescent",459900,null,"Beautiful Gardens Overlooking Quiet Park!","Family Sized Home in Move-In Condition!","VICTORIA VILLAGE"," 43°44'14.54\"N"," 79°18'56.80\"W",43.73737222222222,-79.315777777777768,null,null,null,null,"50 x 120 Feet","$3,315.96/08","3+2","Single Car Garage + 1 Car Parking","1x4, 1x3",null,null,"60-90 Days/TBA","Victoria Park Public School","Milne Valley Middle School","Victoria Park Collegiate Institute","Central Air Conditioning ‘07","Central Vacuum ‘08","100 Amp Service","Stainless Steel Fridge & Stove ‘07","Main Floor Bathroom ‘06","Mostly New Windows with Retractable Screens","In Your Neighbourhood:","The Victoria Village Public Library","The Victoria Village Area","Victoria Terrace Shopping Centre","Sloane, Lawrence & Victoria Park Public Transit Lines","Charles Sauriol Conservation Area","Wigmore Park & Sweeney Park"]
["km000143","ARCHIVE","Family Residential",50,"Three Valleys Drive #10",249000,null,"Spacious Living in Demand Neighbourhood!","Starter Home or Investment! This is the Perfect Opportunity!","YORK MILLS/DON MILLS"," 43°45'8.45\"N"," 79°20'8.10\"W",43.75234722222222,-79.335583333333332,null,null,null,null,null,"$1,819.84/2008","2+1","1 Parking Spot (#48) ","1x4","$312.84/mo (includes building insurance, common elements, water, cable & parking)",null,"Immediate/TBA","Three Valleys Public School","Milne Valley Middle School","George S. Henry Academy","100 Amps","All Updated Windows","Hardwood Flooring Throughout","Central Air Conditioning","Parking Spot Very Close to Entrance"]
["km000144","ARCHIVE","Family Residential",219,"Three Valleys Drive",429900,null,"Super Ravine Lot on Quiet Cul-de-Sac!","Enjoy a Contemporary Open Concept Semi in Immaculate Condition!","YORK MILLS/DON MILLS"," 43°44'40.51\"N"," 79°20'10.29\"W",43.744586111111111,-79.336191666666664,null,null,null,null,"25.85 x 105 Irregular Feet","$3,464.69/08",3,"Carport + 2 Car Parking","1x4, 1x2",null,null,"60 Days/TBA","Three Valleys Public School","Milne Valley Middle School","George S. Henry Academy","Ravine Lot","Roof ‘06","100 Amp Service","Central Air Conditioning ‘03","In Your Neighbourhood:","The New “Shops at Don Mills”","Donalda Golf and Country Club","Broadlands Community Centre","Broadlands Public School (Fr. Immersion)","TTC, DVP & HWY 401"]
["km000145","ARCHIVE","Family Residential",27,"Hamilton Street",429900,null,"Great Multi-Plex Investment!","Prime Location!","QUEEN ST./BROADVIEW"," 43°39'34.85\"N"," 79°21'4.71\"W",43.659680555555553,-79.351308333333321,null,null,null,null,"22.53 x 110.75 Feet","$3,708.74/08",8,"Lane Parking (2 Spots)",null,null,null,"30 Days/TBA","Dundas Public School","Queen Alexandra Senior Public School","Riverdale Collegiate Institute, Danforth C & TI","8 Rental Units","Addition to Rear"]
["km000146","ARCHIVE","Family Residential",1,"Buller Avenue",389900,null,"Attention Renovator's & Builder's!","Location! Perfect Investment Opportunity!","QUEEN/WOODBINE"," 43°40'0.71\"N"," 79°18'13.71\"W",43.666863888888884,-79.303808333333336,null,null,null,null,"16.67 x 105 Feet","$2,780.26/08",2,"None","1x4",null,null,"30 Days/TBA","Kew Beach Junior Public School","Bowmore Junior & Senior Public School","Monarch Park Collegiate Institute, Danforth C & TI"]
["km000147","ARCHIVE","Family Residential",14,"Sulkara Court",739900,null,"Completely Renovated & Updated! Country-Like Setting Minutes to Downtown!","Large Lot with Lots of Flat Table Land & Gorgeous Inground Pool","VICTORIA VILLAGE"," 43°43'52.65\"N"," 79°19'24.83\"W",43.731291666666671,-79.323563888888884,null,null,null,null,"60 x 137.77 Feet","$5,092.05/08",4,"Double Car Garage + 4 Car Parking","1x4, 2x3, 1x2",null,null,"90 Days/TBA","Victoria Village Public School","Milne Valley Middle School","Victoria Park Collegiate Institute","200 Amp Service","Main Roof '02","Garage Roof '06","Two Trance Furnaces '05","Rare & Unique Pie Shaped Lot","Large Flat Table Land & Side Yard with Pool","Located on Quiet Cul-de-Sac","Country Like Setting","East, West & South Exposures","Extensively Updated & Renovated","Mostly New Windows & Doors '02","Surrounded by Wildflife","20 Minutes from Downtown","Sloane, Lawrence & Victoria Park Public Transit Lines"]
["km000148","ARCHIVE","Family Residential",28,"North Hills Terrace",479900,null,"Sought After Don Mills Location!","Attention First Time Buyers! Great Investment Opportunity!","DON MILLS/LAWRENCE"," 43°43'46.77\"N"," 79°20'18.73\"W",43.729658333333333,-79.338536111111111,null,null,null,null,"58 x 110 Feet Rear: 65.2 Feet (See Survey)","$3,464.69/08",3,"Single Car Garage + 2 Car Parking","1x4",null,null,"30 Days/TBA","Greenland Public School, Norman Ingram Public School","Don Mills Middle School","Don Mills Collegiate Institute, Northern Secondary School","Roof  Re-Shingled Fall ‘08","100 Amp Service","All Updated Windows","Underground Sprinkler System"]
["km000149","ARCHIVE","Family Residential",97,"Degrassi Street",269900,null,"Super Investments Needing TLC!","Great Location! Steps to The Beach & Queen Street Shopping!","QUEEN/DUNDAS"," 43°39'43.52\"N"," 79°20'48.08\"W",43.662088888888889,-79.346688888888877,null,null,null,null,"17.25 x 99 Feet","$2,266.05/2008",3,null,"1x3",null,null,"30 Days/TBA"]
["km000150","ARCHIVE","Family Residential",150,"Broadlands Boulevard",449900,1500,"For Lease:  Spacious Bungalow Steps to All Amenities!","Updated Family Sized Eat-in Kitchen Overlooks Back Garden!","LAWRENCE/UNDERHILL"," 43°44'50.56\"N"," 79°18'49.48\"W",{"$f":"IF(ISBLANK(K92),\"\",DMS_to_Dec(K92))","v":43.747377777777778},{"$f":"IF(ISBLANK(L92),\"\",DMS_to_Dec(L92))","v":-79.313744444444438},null,null,null,null,"60 x 100 Feet","$3,333.46/2008","3+2","2 Car Parking","1x4",null,null,"60 Days/TBA","Cassandra Public School & Ranchdale Public School","Milne Valley Middle School","Victoria Park Collegiate Institute","In Your Neighbourhood:","The New Shops at Don Mills","Donalda Golf and Country Club","Broadlands Community Centre","Broadlands Public School (Fr. Immersion)","Cassandra Public School","Ranchdale Public School","Milne Valley Middle School","Victoria Park High School","Crestwood Preparatory College","Senator O’Connor High School","TTC & DVP"]
["km000151","ARCHIVE","Family Residential",145,"Rhodes Avenue",199900,null,"Renovator's Dream!","Land Value in Super Hype Location!","QUEEN/COXWELL"," 43°40'10.91\"N"," 79°19'8.72\"W",43.669697222222219,-79.319088888888885,null,null,null,null,"28.5 x 110 Feet","$1,802.34/2008",0,0,0,null,null,"30 Days/TBA","Duke of Connaught Junior Public School","Duke of Connaught Senior Public School","Monarch Park Collegiate Institute, Danforth C & TI"]
["km000152","ARCHIVE","Family Residential",31,"Glen Gannon Drive",599900,null,"Lavish & Funky Loft Style Detached Home!","Super Huge Garden Oasis Backing On To Ravine!","St. CLAIR/O'CONNOR"," 43°42'18.24\"N"," 79°18'28.93\"W",43.705066666666667,-79.308036111111107,"http://tours.advirtours.com/110328P",null,null,null,"42 x 183 Feet","$3,525.94/08","1+1","Single Car Garage + 2 Car Parking","1x5, 1x3",null,null,"30 Days/TBA","Selwyn Elementary School","Gordon A. Brown Middle School","East York Collegiate Institute","Three Ton Air Conditioning System '06","Roof '06","100 Amp Service","Completely Renovated","Backs On To Ravine","House Completely Wired for Surround Sound","Five Walk-Outs","Extra Large Lot","Outdoor Fireplace"]
["km000153","ARCHIVE","Condo",28,"Hollywood Avenue #1210",249900,null,"Fabulous Location! Private Open Balcony!","Large Kitchen with Ensuite Laundry! City Views from All Windows!","YONGE/SHEPPARD"," 43°45'59.52\"N"," 79°24'37.13\"W",43.766533333333335,-79.410313888888894,null,null,null,null,null,"$2,064.82/2008","1+1","1 Underground Spot (A34)","1x4","$442.94/mo (includes:Heat, hydro, water, cable, central air conditioning, parking, building insurance & common elements)",1,"Immediate","McKee Public School","Bayview Middle School","Earl Haig Secondary School","In Your Neighbourhood:","Yonge Street Shopping & Restaurants","Bayview Avenue Shopping","Highway 401 & DVP","TTC & Subway","Movie Theatres","Amenities:","Indoor pool","Sauna","Recreation Room with Kitchen & Dance Floor","Exercise Room","Two Guest Suites","Concierge","Locker (T)"]
["km000154","ARCHIVE","Family Residential",86,"Valentine Drive",699900,null,"Rare Centre Hall Plan in Spacious & Updated 2 Storey Home!","Sought After Donalda Neighbourhood!","DON MILLS/YORK MILLS"," 43°45'41.94\"N"," 79°20'36.73\"W",43.761650000000003,-79.343536111111106,null,null,null,null,"51.46 x 135.08 Feet","$4,007.15/2008",4,"Double Car Garage + 2 Car Parking","1x5, 1x3, 2x2",null,null,"January 2009/TBA","Rene Gordon Elementary School","Donview Middle School","George S. Henry Academy","Front & Rear Extension Addition","Roof ‘08","New Garage Doors ‘08","New Aluminum Siding & Eavestroughs on Front of House ‘08","100 Amp Service","Updated Kitchen","Two Fireplaces","All Updated Windows"]
["km000155","ARCHIVE","Family Residential",111,"Plateau Crescent",649900,null,"Gorgeous & Updated Super Size Family Home!","Large Private Back Garden with Flagstone Patio & 2-Tier Wooden Deck!","DON MILLS/LAWRENCE"," 43°43'59.80\"N"," 79°20'9.77\"W",43.733277777777779,-79.33604722222222,"http://tours.advirtours.com/110433P",null,null,null,"46.1 x 112.2 Feet Rear 73 Feet ( Per Survey)","$3,657.18/2008",3,"Single Car Garage + 3 Car Parking","1x4, 1x3, 1x2",null,null,"60 Days/TBA","Greenland Public School, Norman Ingram Public School","Don Mills Middle School","Don Mills Collegiate Institute, Northern Secondary School","200 Amp Service","Roof ‘99","Central Air Conditioning ‘00","New Kitchen","New Hardwood Flooring on Main Floor","All Updated Bathrooms","All Updated Windows","Main Floor Family Room"]
["km000156","ARCHIVE","Family Residential",15,"Royal Doulton Drive",517000,null,"Family Home in Sought After Neighbourhood!","Spacious Bungalow with 2 Walk-outs & Inground Pool!","LAWRENCE/UNDERHILL"," 43°44'47.89\"N"," 79°19'28.05\"W",43.746636111111115,-79.324458333333325,null,null,null,null,"55 x 110 Feet","$3,560.93/2008","3+4","Single Car Garage + 5 Car Parking","2x4",null,null,"60 Days/TBA","Cassandra Public School & Ranchdale Public School","Milne Valley Middle School","Victoria Park Collegiate Institute","100 Amp Service","Central Air Conditioning System","Roof: Back ’03","Furnace ‘90","In-Ground Kidney Shaped Pool","New Pool Liner","New Pool Heater '03","New Pool Pump '03","In Your Neighbourhood","Minutes to The New “Shops at Don Mills”","Short walk to Donwoods Plaza","Donalda Golf and Country Club","TTC, DVP & Highway 401","Broadlands Public School (Fr. Immersion)","Crestwood Preparatory College & Senator O’Connor High School"]
["km000157","ARCHIVE","Family Residential",7,"Prestbury Street",499900,null,"Skylights! Updated & Main Floor Family Room with Walk-out to Pool!","Large Family Size Kitchen with Eat-in Area & Walk-out to Deck!","VICTORIA VILLAGE"," 43°44'13.15\"N"," 79°18'34.18\"W",43.736986111111115,-79.309494444444439,null,null,null,null,"52 x 115 Feet ","$3,700.92/2008",4,"3 Car Parking","2x4, 1x2",null,null,"January 2009/TBA","Victoria Village Public School","Milne Valley Middle School","Victoria Park Collegiate Institute","Roof ‘97","100 Amp Service","Central Vacuum","Central Air Conditioning ‘04","Furnace & Humidifier ‘96","Mostly New Windows","Main Floor Family Room","Water Service Upgraded ‘00","In Your Neighbourhood:","The Victoria Village Public Library","The Victoria Village Area","Victoria Terrace Shopping Centre","Sloane, Lawrence & Victoria Park Public Transit Lines","Charles Sauriol Conservation Area","Wigmore Park & Sweeney Park"]
["km000158","ARCHIVE","Family Residential",73,"Farmbrook Road",239900,null,"Attention First Time Buyers & Renovators!","Steps to Schools, Parks & Ravine!","LAWRENCE/BELLAMY"," 43°44'53.10\"N"," 79°13'44.75\"W",43.748083333333334,-79.229097222222222,null,null,null,null,"44 x 120 Feet","$2,242.97/2008",3,"2 Car Parking","1x4",null,null,"30 Days/TBA","Cedarbrook Junior Public School","John McCrae Senior Public School","Cedarnrae Collegiate Institute"]
["km000159","ARCHIVE","Condo",88,"Broadway Avenue #404",null,1300,"New Building Steps to Yonge Street Shopping!","Brand New and Move-in Ready!","YONGE/EGLINTON"," 43°42'38.56\"N"," 79°23'39.17\"W",43.710711111111117,-79.394213888888899,null,null,null,null,0,0,1,0,"1x4",null,null,"Jan 2 2010",null,null,null,"2 Walk-outs to balcony","Granite Countertop","Stainless Steel Appliances","Unobstructed Views"]
["km000160","ARCHIVE","Family Residential",93,"Pinemore",319900,null,"Fantastic Bungalow in Family Neighbourhood!","Super for First Time Buyers or Young Families!","YORK MILLS/VICTORIA PARK"," 43°45'22.16\"N"," 79°19'1.87\"W",43.756155555555559,-79.317186111111113,null,null,null,null,"33 x 112 Feet","$2,703.51/2008",3,"Carport + 2 Car Parking","1x4, 1x3",null,null,"Immediate","Ranchdale Public School","Donview Middle School","Victoria Park Collegiate Institute","Nostalgic Mohagany Built-in Cabinetry","Newer Appliances","Updated Plumbing","Eat-in Kitchen"]
["km000161","ARCHIVE","Family Residential",162,"Three Valleys Drive",459900,null,"Backs on to Donalda Ravine, Steps to Schools & Walking Paths!","Spacious Home with Table Land Overlooking Ravine!","YORK MILLS/DON MILLS"," 43°44'44.79\"N"," 79°20'16.09\"W",43.745775000000002,-79.337802777777767,null,null,null,null,"36 x 123 FEET","$3,508.44/2008","3 or 4","Single Car Garage + 2 Car Parking","2x4",null,null,"Jan or Feb 2009","Three Valleys Public School","Milne Valley Middle School","George S. Henry Academy","100 Amps","Roof ‘01","Central Air Conditioning","Mostly New Windows","Ravine Lot","Table Land"]
["km000162","ARCHIVE","Condo",5100,"Highway A1A #D36",null,3000,"Prestigious Pebble Beach Villas in Vero Beach!","With a rental of 3 months or more, John Welsh will provide 2 FREE RETURN AIRFARES FROM TORONTO OR MONTREAL TO ORLANDO !!!!!!!  ","VERO BEACH/FLORIDA",null,null,"","",null,null,null,null,null,0,2,"1 Car Parking","1x4",0,null,null,null,null,null,"Pool","Tennis Courts","Shuffle Board","Clubhouse","Ocean at Your Doorstep"]
["km000163","ARCHIVE","Family Residential",24,"Foxden Road",399900,null,"Spacious & Wonderfully Updated Family Home!","Perfect for Starter Home Steps to The New Shops at Don Mills","DON MILLS/LAWRENCE"," 43°43'44.05\"N"," 79°20'35.76\"W",43.728902777777776,-79.343266666666665,null,null,null,null,"31 x 125.5 Feet","$3,000.98/2008",3,"Single Car Garage + 2 Car Parking","1x4, 1x2",null,null,"60 Days/TBA","Greenland Public School, Norman Ingram Public School","Don Mills Middle School","Don Mills Collegiate Institute, Northern Secondary School","100 Amp Service Circuit Breakers","New Kitchen ‘01","Roof ‘05","Garage Door ‘01","Garage Floor ‘07","Professionally Landscaped Front & Back Yards ‘05","Central Air Conditioning","Updated Windows","Instant Hot Water Tank","Whole house water softener ‘05"]
["km000164","ARCHIVE","Condo",2,"Glamorgan Avenue",99900,null,"Perfect for Commuters or a Bachelor!","Lots of Space & Enjoy an Open Balcony!","KENNEDY/HWY 401"," 43°46'7.12\"N"," 79°16'56.98\"W",43.76864444444444,-79.282494444444438,null,null,null,null,null,"$1,031.94/2008",1,"1 Underground Spot (#33)","1x4","$479.85 (includes: water, cable tv, heat, hydro, common elements, building insurance & parking)",null,"30 Days/TBA"]
["km000165","ARCHIVE","Family Residential",23,"Stonedale Placeway",419900,null,"Live in Prestigious Denlow School District!","Updated Home! 3 Levels of Above Ground Living!","LESLIE/YORK MILLS"," 43°45'5.88\"N"," 79°21'38.89\"W",43.751633333333331,-79.360802777777778,null,null,null,null,null,"$2,834.75/2008",3,"Single Car Garage + 1 Car Parking","1x4, 2x2","$440/mo (includes cable, water, street snow removal, landscaping, exterior maintenance, garbage removal & recycling) ",null,"90 Days/TBA","Denlow Public School","Windfields Junior High School","York Mills Collegiate Institute, Northern Secondary School","All New Windows 2002","Roof '07","Furnace '02","100 Amp Services","Central Air Conditioning ","New Custom Made Solid Wood Front Door ‘06","High baseboards throughout main floor","Family Friendly Street","Located on a Cul-de-Sac","Banbury Tennis Club & Community Centre","Bond Park & Don Mills Tennis Club","Edwards Gardens","TTC, DVP & Highway 401 (1 bus to York Mills Station)","Walk to Shops & Restaurants","Many Private Schools in the Area"]
["km000166","ARCHIVE","Family Residential",23,"Rialto Drive",399900,null,"Great Family Home Steps to Schools & Parks!","Attention First Time Buyers!","LAWRENCE/UNDERHILL"," 43°44'37.46\"N"," 79°19'2.90\"W",{"$f":"IF(ISBLANK(K108),\"\",DMS_to_Dec(K108))","v":43.743738888888892},{"$f":"IF(ISBLANK(L108),\"\",DMS_to_Dec(L108))","v":-79.317472222222221},null,null,null,null,"60 X 130 Feet","$3,149.97/2008",3,"Carport + 5 Car Parking","1x4",null,null,"60-90 Days/TBA","Cassandra Public School & Ranchdale Public School","Milne Valley Middle School","Victoria Park Collegiate Institute","In Your Neighbourhood:","New Furnace ‘08","New Central Air Conditioning ‘06","Roof ‘03","100 Amp Service","Updated Bathroom","Reinforced Attic Insulation","Large Lot"]
["km000167","ARCHIVE","Family Residential",151,"Three Valleys Drive",458800,null,"Super Semi on Sought After Street!","Ravine Property with Table Land!","YORK MILLS/DON MILLS"," 43°44'46.49\"N"," 79°20'10.53\"W",43.746247222222223,-79.336258333333333,null,null,null,null,"35 x 148.5 Feet","$3,455.94/2008",3,"Single Car Garage + 2 Car Parking","1x4, 1x2",null,null,"60 Days/TBA","Three Valleys Public School","Milne Valley Middle School","George S. Henry Academy","Ravine Lot","New Kitchen ‘09","New Hardwood Flooring Throughout","New & Updated Bathrooms","Roof ‘00","100 Amp Service","Stainless Steel Appliances"]
["km000168","ARCHIVE","Family Residential",125,"Dallimore Circle ",399900,null,"Freehold Townhouse is Commuter's Paradise!","Built in 2002, This 2 Storey Home is Super for Young Families!","DON MILLS/LAWRENCE"," 43°43'49.23\"N"," 79°19'56.79\"W",43.730341666666668,-79.332441666666668,null,null,null,null,"18.5 x 79.4 Feet","$2,939.74/2008",3,"Single Car Garage + 1 Car Parking","1x4, 1x2",null,null,"June 2009/TBA","Greenland Public School, Norman Ingram Public School","Don Mills Middle School","Don Mills Collegiate Institute","Freehold Townhouse ‘02","100 Amp Service","Hardwood Flooring Throughout Main Floor","Steps to Ravine & Moccasin Walking Trails","In Your Neighbourhood:","Don Mills Public Library","Civitan Don Mills Arena","Donalda Golf and Country Club","Bond Park","Don Mills Tennis Club","TTC, DVP & Highway 401","The New “Shops at Don Mills”"]
["km000169","ARCHIVE","Family Residential",11,"Bannatyne Drive",869900,null,"Large 2 Storey Home in Prestigous Neighbourhood!","Beautigully Updated Family Home Steps to All Amenities!","LESLIE/BANNATYNE"," 43°45'50.68\"N"," 79°22'25.30\"W",43.764077777777779,-79.373694444444439,"http://tours.advirtours.com/110974P",null,null,null,"60 x 136 Feet (Pie Shape with 75 Feet at Rear)","$6,299.44/2008",4,"Double Car Garage + 4 Car Parking","1x4, 1x3, 1x2",null,null,"30/60 Days/TBA","Dunlace Public School","Windfields Junior High School","York Mills Collegiate Institute, Northen Secondary School","New Kitchen’09","Two Central Air Conditioners (One is’08)","Central Vacuum","100 Amp Service","New Front Door’08","Main Floor Family Room","All Updated Bathrooms","Freshly Painted Throughout","Inground Pool with new Pump’08 & New High Efficiency Pool Heater’08","Newer Hardwood Flooring Throughout Main Floor"]
["km000170","ARCHIVE","Family Residential",139,"Brownstone Circle",449900,null,"Spacious Living in 2 Storey Townhouse! Lots of Storage!","Unspoiled Lower Level with Walk-out to Garden!","YONGE/CLARK"," 43°48'29.65\"N"," 79°25'34.25\"W",43.808236111111107,-79.426180555555561,null,null,null,null,"19.68 x 111 Feet","$3,287.71/2008",3,"Single Car Garage + 2 Car Parking","1x5, 1x4, 1x2",null,null,"90 Days/TBA",null,null,null,"Ravine Lot","Roof ’05","Furnace’05","100 Amp Service","Aluminum Eaves & Soffits","Central Air Conditioning","All Updated Windows"]
["km000171","ARCHIVE","Family Residential",70,"Castlegrove Boulevard",505000,null,"New Kitchen with Heated Travertine Flooring, Granite Counter Tops & Stainless Steel Appliances!","Sought After Family Neighbourhood & Steps to Schools, Parks & Transportation!","LAWRENCE/UNDERHILL"," 43°44'52.31\"N"," 79°19'6.40\"W",43.747863888888887,-79.318444444444438,null,null,null,null,"73.63 x 129.28 Feet","$3,534.69/2008","3+1","Single Car Garage + 2 Car Parking","1x4, 1x3",null,null,"June 2009/TBA","Cassandra Public School & Ranchdale Public School","Milne Valley Middle School","Victoria Park Collegiate Institute","100 Amp Service","New Kitchen’08","New Main Bathroom’08","Refinished Hardwood Flooring Throughout’07","LG Art Cool Air Conditioner","Newer Roof"]
["km000172","ARCHIVE","Family Residential",27,"Farmcote Road",529900,null,"Opportunity Knocks in Super Don Mills Bungalow!","Ravine Lot with Donalda Golf Course Views!","DON MILLS/LAWRENCE"," 43°44'49.12\"N"," 79°20'37.61\"W",43.746977777777779,-79.343780555555554,null,null,null,null,"61 x 158 Feet Ravine Lot ","$4,462.11/2008",3,"Carport + 4 Car Parking","1x4, 1x2",null,null,"30 Days/TBA","Greenland Public School, Norman Ingram Public School","Don Mills Middle School","Don Mills Collegiate Institute, Northern Secondary School","Ravine Lot","Roof ’05","Furnace’05","100 Amp Service","Aluminum Eaves & Soffits","Central Air Conditioning","All Updated Windows"]
["km000173","ARCHIVE","Family Residential",83,"Pinemore Crescent",309900,null,"Super Location! Great for First Time Buyers!","Great Opportunity Steps to Shops, TTC, HWY 401 & DVP!","VICTORIA PARK/ELLESMERE"," 43°45'23.36\"N"," 79°18'59.29\"W",43.756488888888889,-79.316469444444436,null,null,null,null,"33 x 99 Feet","$2,581.02/2008","3+1","2 Car Parking","1x4, 1x3",null,null,"March/April 2009","Ranchdale Public School","Donview Middle School","Victoria Park Collegiate Institute","All Windows Updated","100 Amp Service","Updated Kitchen"]
["km000174","ARCHIVE","Family Residential",11,"Proudbank Millway",569900,null,"Completely Renovated in 2006!","Cusom Crafted & Designed Barbini Kitchen!","BAYVIEW/YORK MILLS"," 43°44'59.18\"N"," 79°22'56.73\"W",43.749772222222227,-79.382424999999998,null,null,null,null,null,"$3,840.91/2008",3,"Single Car Garage + Single Car Parking","1x4, 1x3, 1x2","$391.23 (includes: water, parking, common elements, building insurance, landscaping & planting, recycling, garbage & snow removal)",null,"June 2009/TBA","Harrison Public School","Windfields Junior High School","York Mills Collegiate Institute & Northern Secondary School","Completely Renovated ‘06","Refinished Walnut Stained Hardwood Flooring ‘06","Open Concept Designed Kitchen ‘06","Satin Nickel Hardware Throughout ‘06","100 Amp Service ‘06","Furnace ‘07","Custom Window Coverings ‘06","Stainless Steel Appliances ‘06"]
["km000175","ARCHIVE","Family Residential",49,"Roanoke Road",579900,null,"Gorgeous New 'Beckerman' Kitchen with Granite Countertops & Polished Marble Backsplash!","Spacious Living in This Fantastic Family Home!","LAWRENCE/UNDERHILL"," 43°44'32.18\"N"," 79°19'21.90\"W",43.742272222222226,-79.322749999999999,null,null,null,null,"50 x 134 Feet","$3,534.69/2008",4,"Single Car Garage + 2 Car Parking","1x5, 1x4, 1x2",null,null,"October 2009/TBA","Cassandra Public School & Ranchdale Public School","Milne Valley Middle School","Victoria Park Collegiate Institute","New Beckerman Kitchen ‘08","Main Bathroom and Powder Room New '01","Basement Bathroom New '07","Roof ‘06","All New Windows","All New Doors, Mouldings & Trim","All New Pot Lights in Living Room, Dining Room, Kitchen & Recreation Room","Recreation Room New in '01","Laundry Room & Basement Bathroom New in '07","Central Air Conditioning","100 Amp Service","Central Vacuum"]
["km000176","ARCHIVE","Family Residential",859,"Coxwell Avenue",320500,null,"Steps to All Amenities!","Great for First Time Buyer!","COXWELL/MORTIMER"," 43°41'32.06\"N"," 79°19'37.58\"W",43.692238888888888,-79.327105555555548,null,null,null,null,"34 x 104 Feet","$2,072.40/2008","2+2","Single Car Garage + 2 Car Parking","2x4",null,null,"30 Days/TBA","RH McGregor Elementary School","Cosburn Middle School","East York Collegiate Institute & Danforth C&TI"]
["km000177","ARCHIVE","Family Residential",6,"Farmstead Road",489900,null,"Largest 4 Bedroom Townhouse in Complex!","Updated & Move-in Ready! Backs on to Park, Green Space & Tennis Courts!","LESLIE/YORK MILLS"," 43°45'17.59\"N"," 79°21'40.61\"W",43.754886111111112,-79.361280555555552,null,null,null,null,null,"$3,333.46/2008",4,"Single Car Garage + Single Car Parking","1x4, 1x3, 1x2",null,null,"30 Days/TBA","Dunlace Public School","Windfields Junior High School","York Mills Collegiate Institute, Northern Secondary School","Largest Unit in Complex","100 Amp Service","Kitchen '99","Backs onto Green Space, Park & Tennis Courts","All Updated Bathrooms","Central Air Conditioning","In Your Neighbourhood:","The New Shops at Don Mills","Bond Park","Don Mills Tennis Club","Many Private Schools in the Area","Walk to Shops & Restaurants","Five Minutes to North York General Hospital","TTC, DVP & Highway 401"]
["km000178","ARCHIVE","Family Residential",2350,"Bridletowne Circle #1211",219900,null,"Immaculate Condo with Den & Solarium!","Super Huge Condo Complex with Amazing Facilities!","WARDEN/FINCH"," 43°48'1.11\"N"," 79°18'59.86\"W",43.800308333333334,-79.316627777777768,null,null,null,null,null,"$1,833.61/2008","1+1","1 Spoke (P1, #29)","1x4, 1x2","$553.84 (Includes: water, heat, hydro, cable, central air conditioning, building insurance, parking & common elements.)",null,"60 Days/TBA"]
["km000179","SOLD","Family Residential",23,"Kestell Lane",789900,null,"Gorgeous Ravine Golf Course Views on Large Lot!","Sun Flooded & Spacious Home on Quiet Cul-de-Sac!","YORK MILLS/DON MILLS"," 43°44'54.97\"N"," 79°20'23.30\"W",43.748602777777776,-79.339805555555557,null,null,null,null,"39 X 111.45 Feet, REAR: 141.9, WEST SIDE: 192.35","$5,687/08",4,"Double Carport + 2 Car Parking","2x4",null,null,"90 Days/TBA","Three Valleys Public School","Milne Valley Middle School","George S. Henry Academy","Roof ‘08","Central Air Conditioning ‘08","All Updated Windows ‘97","Updated Kitchen","Two Full Updated Bathrooms","100 Amp Service"]
["km000180","ARCHIVE","Family Residential",255,"The Donway West #515",329900,null,"Spacious End Unit with Tons of Sun Light!","Live in the Heart of Don Mills! Steps to Shopping, TTC, Highway 401 & DVP!","DON MILLS/LAWRENCE"," 43°44'23.48\"N"," 79°20'44.29\"W",43.739855555555557,-79.345636111111105,null,null,null,null,null,"$2,659.76/2008",2,"1 Spot (#6)","1x4, 1x3","$486.68 (includes: water, cable, parking, common elements & building insurance)","#205","30 Days/TBA"]
["km000181","ARCHIVE","Family Residential",14,"Doonaree Drive",370000,null,"Attention Builder/Renovator! Super Opportunity in Don Mills!","First Time Buyer's Best Investment!","LAWRENCE/UNDERHILL"," 43°44'44.97\"N"," 79°19'36.43\"W",43.745825000000004,-79.326786111111105,null,null,null,null,"36 x 110 Feet","$2,791/2008","3+1","Single Car Garage + 2 Car Parking","1x5",null,null,"30 Days/TBA","Cassandra Public School ","Milne Valley Middle School","Victoria Park Collegiate Institute"]
["km000182","ARCHIVE","Family Residential",28,"Lochinvar Crescent",549900,null,"Completely Renovated in Don Mills!","Steps to Donalda Golf Course!","DON MILLS/YORK MILLS"," 43°45'32.14\"N"," 79°20'18.09\"W",43.758927777777778,-79.338358333333332,null,null,null,null,"50.98 x 133.04 Feet","$3,837.97/2009","3+2","Single Car Garage + 4 Car Parking","1x4, 2x2, 1x1",null,null,"60/90 Days/TBA","Rene Gordon Elementary School","Donview Middle School","George S. Henry Academy","Roof '05","100Amp Service","New Kitchen","New 2-Tier Deck","Central Air Conditioning","New High Efficiency Furnace","New French Door out to Deck","New Garage Door","New Double Driveway","All Main Floors Refinished","Three New Bathrooms","New Doors on Main Floor"]
["km000183","ARCHIVE","Family Residential",202,"Glenwood Crescent",429900,null,"Super Detached Starter Home with Large Lot!","Hardwood Flooring, Mostly Updated Windows & Great Location!","WOODBINE GARDENS"," 43°42'20.03\"N"," 79°18'31.16\"W",43.705563888888889,-79.308655555555546,null,null,null,null,"35 x 117 Feet","$3,010.53/2008",3,"Tandem Garage + 2 Car Parking","1x4",null,null,"30 Days/TBA","Selwyn Elementary School","Gordon A. Brown Middle School","East York Collegiate Institute,  Danforth Collegiate & Technical Institute","In Your Neighbourhood:","Steps to O’Connor Business Area at St. Clair","Taylor Creek Park & Walking Trails","TTC & Bloor-Danforth Subway Line","DVP & Highway 401","Selwyn Elementary School","Gordon A Brown Middle School","East York Collegiate Institute","Danforth Collegiate & Technical Institute"]
["km000184","ARCHIVE","Family Residential",6,"Ethelwin Avenue",499900,null,"Spacious Detached 2.5 Story Home with Finished Lower Level!","Live Steps to the Danforth, TTC, Subway, Schools & Parks! ","DANFORTH/WOODBINE"," 43°41'5.66\"N"," 79°18'35.26\"W",43.684905555555552,-79.309794444444435,null,null,null,null,"20 x 90 Feet","$3,420.95/08","3+1",null,"2x4, 1x3, 1x2",null,null,"60 Days/TBA","Gledhill Junior Public School","Earl Beatty Junior & Public School","Monarch Park Collegiate Institute, Eastern Commerce Collegiate & Danforth Collegiate & Technical Institute","100 Amp Service","New Furnace ‘08","Three Skylights","Updated Water Service from Street","New Duct Work","Chimney Rebuilt – Brick Tuck Pointed","All Updated Bathrooms ‘96"]
["km000185","ARCHIVE","Family Residential",148,"Fenside Drive",349900,null,"Live in a Semi-Detached Home with the Space of a Detached!","Move-in Condition! Updated from Top to Bottom!!","YORK MILLS/FENSIDE"," 43°45'52.42\"N"," 79°19'47.58\"W",43.764561111111114,-79.329883333333328,null,null,null,null,"29.98 x 119.58 Feet","$2,554.77/08",4,"3 Car Parking","2x4",null,null,"30 Days or TBA","Fenside Public School","Donview Middle School","George S. Henry Academy","Roof  Newly Tarred","Chimney Tuck Pointed","100 Amp Service","Furnace ‘94","Central Air Conditioning ‘94","All New Windows","All New Interior & Front Entrance Doors ‘07","All Bathrooms are Fully Updated"]
["km000186","ARCHIVE","Family Residential",63,"Angora Street",311000,null,"Spacious Living in Updated Backsplit!","Steps to Schools, Parks, Transit & Shopping!","LAWRENCE E./S.G.C. RD."," 43°45'33.02\"N"," 79°12'34.84\"W",43.759172222222219,-79.209677777777785,null,null,null,null,"50 x 122.97 Feet","$2,311.21/2008","3+1","Single Car Garage + Single Car Parking","2x4",null,null,"September 2009 or TBA","Willow Park Junior Public School","Tecumseh Senior Public School","Cedarnrae Collegiate Institute, Sir Robert L Borden BTI, Maplewood High School","Roof – ‘04","Central Air Conditioning ‘95","Furnace ‘94","100 Amp Fuses","Two Full Updated Bathrooms"]
["km000187","ARCHIVE","Family Residential",7,"Spy Apple Way",239900,null,"Corner Unit! Updated and Spacious!","Private Fenced Back Garden!","LAWRENCE/VICTORIA PARK"," 43°44'41.85\"N"," 79°18'46.32\"W",{"$f":"IF(ISBLANK(K129),\"\",DMS_to_Dec(K129))","v":43.744958333333336},-79.312866666666665,null,null,null,null,null,"$1,914.63/2008",3,"Single Car Parking","1x4, 1x2","$250 (includes basic cable, water, common elements, building insurance & parking)",null,"July 2009/TBA","Cassandra Public School & Ranchdale Public School","Milne Valley Middle School","Victoria Park Collegiate Institute","Maple Hardwood Flooring Throughout ‘07","Furnace","Central Air Conditioning System","Roof ‘08","Updated Kitchen Craft Canadian Kitchen ‘99","Stainless Steel Fridge, Stove & Built-in Microwave‘07","End Unit","Lots of Visitor Parking","Mostly Updated Windows"]
["km000188","ARCHIVE","Family Residential",129,"Glen Albert Drive",379900,null,"Quiet Family Friendly Street! Backs on to Park!","Hardwood Flooring Throughout! Separate Entrance to Finished Lower Level!","ST.CLAIR/O'CONNOR"," 43°42'8.65\"N"," 79°18'5.26\"W",43.702402777777777,-79.301461111111109,null,null,null,null,"40 X 106 Feet","$2,569.19/2008","2+1","2 Car Parking","1x4, 1x3",null,null,"June 2009 or TBA","George Webster Elementary School ","Gordon A. Brown Middle School","East York Collegiate Institute, Danforth C&TI","All New Windows ‘97","100 Amp Service","Furnace ‘03","Hot Water Tank Owned ‘03","Two Newer Bathrooms","Back Garden Overlooks Park"]
["km000189","ARCHIVE","Family Residential",28,"Abbeywood Trail",849900,null,"Beautifully Updated Home in Prestigious Denlow Estates!","Upgrated from Top to Bottom! Move-in and Enjoy!","LESLIE/YORK MILLS"," 43°44'52.85\"N"," 79°22'0.03\"W",43.748013888888892,-79.366674999999987,"http://tours.advirtours.com/111710P",null,null,null,"55 x 120 Feet","$5,328.28/2008","4+1","Double Car Garage + 2 Car Parking","1x5, 1x4, 1x2",null,null,"90 Days or TBA","Denlow Public School","Windfields Junior High School","York Mills Collegiate Institute & Northern Secondary School","New Kitchen – top of the line stainless steel appliances – granite countertop – pot lights","New Hardwood Flooring Throughout Main Floor","Mostly Updated Thermal Windows","Carrier Whisperquiet Central Air Conditioning System ‘05","Aprilaire Central Humidifier","Electronic Air Cleaner","Furnace ‘95","Roof ‘94","200 Amp Service","Updated Main Floor Laundry Room","Main Floor Family Room with gas fireplace","In-ground Pool with New Liner, Heater, chlorinator, concrete deck, in-pool steps & piping","All Updated Bathrooms","Pot lights in entrance hallway & main floor passages"]
["km000190","ARCHIVE","Condo",101,"Prudential Drive #906",94900,null,"Great Views! Needs TLC!","Attention First Time Buyers!","LAWRENCE/MIDLAND"," 43°44'56.17\"N"," 79°16'0.23\"W",{"$f":"IF(ISBLANK(K132),\"\",DMS_to_Dec(K132))","v":43.748936111111114},{"$f":"IF(ISBLANK(L132),\"\",DMS_to_Dec(L132))","v":-79.266730555555554},null,null,null,null,null,"$1,027.67/2008",1,"1 Parking Spot (#303) ","1x4","$385.06 (includes water, heat, hydro, building insurance, common elements & parking)",null,"30 Days/TBA"]
["km000191","ARCHIVE","Family Residential",38,"Fairhill Crescent",459900,null,"Large Detached Home with Private Back Garden!","Lots of Opportunity in this Spacious Detached Family Home!","LAWRENCE/UNDERHILL"," 43°44'52.64\"N"," 79°19'17.78\"W",{"$f":"IF(ISBLANK(K133),\"\",DMS_to_Dec(K133))","v":43.747955555555556},{"$f":"IF(ISBLANK(L133),\"\",DMS_to_Dec(L133))","v":-79.32160555555555},null,null,null,null,"55 x 110 Feet","$3,228.46/2008",3,"4 Car Parking","1x4, 1x2",null,null,"30 Days or TBA","Cassandra Public School & Ranchdale Public School","Milne Valley Middle School","Victoria Park Collegiate Institute"]
["km000192","ARCHIVE","Family Residential",1,"Charnwood Road",589900,null,"Premium Oversized Lot in the Heart of Don Mills!","Super Investment! Private Lot!","LESLIE/LAWRENCE"," 43°44'38.88\"N"," 79°21'25.63\"W",{"$f":"IF(ISBLANK(K134),\"\",DMS_to_Dec(K134))","v":43.744133333333338},-79.357119444444436,null,null,null,null,"79.92 X 130 Feet Irregular","$4,129.63/2008","2+1","3 Car Parking","1x4, 2x3",null,null,"30 Days or TBA","Rippleton Public School","St. Andrews Public High School, Windfields Junior High School","York Mills Collegiate Institute & Northern Secondary School","100-amp Electrical Panel ’07","Hot Water Tank ‘04","Water softener ‘04","Central Air Conditioner ‘04","Two driveways and pathways replaced with interlock ‘02","ADT Security System with Motion Detectors Wired Through 9 Zones","Mostly Newer Windows ‘99-‘01","Roof‘98"]
["km000193","ARCHIVE","Family Residential",81,"Navy Wharf Court #701",289900,null,"Lake Views from Balcony!","Beautiful Upgrades! Lots of Storage in this 1+1!","SPADINA/FRONT"," 43°38'27.78\"N"," 79°23'30.36\"W",43.64105,-79.391766666666669,null,null,null,null,null,"$1,889.83/2008","1+1","1 Underground Spot (#75)","1x4","$423.32/mo (includes: water, heat, hydro, central air, building insurance, common elements & parking)",null,"90 Days or TBA",null,null,null,"Steps to Union Station, TTC, Gardener Expressway, Shopping & Restaurants, Rogers Centre, The ACC","Granite Countertops & Foyer Flooring!","Ensuite Laundry","Open Concept","Balcony with Views!","Lots of Storage!"]
["km000194","ARCHIVE","Condo",10,"Sunrise Avenue #419",197000,null,"Penthouse in Low Rise Building!","Steps to Shops, TTC, DVP & Subway!","VICTORIA PARK/EGLINTON"," 43°43'13.61\"N"," 79°18'5.37\"W",43.720447222222226,-79.301491666666664,null,null,null,null,null,"$1,531.11/2008",3,"1 Underground Spot (#63)","1x4, 1x2","$594.12/mo (Includes: water, heat, hydro, basic cable, parking, building insurance & common elements)","1 (#79)","60 Days/TBA","O’Connor Public School","Gordon A Brown Middle School, Milne Valley Middle School\n","East York Collegiate Institute, Marc Garneau Collegiate Institute, Victoria Park Collegiate Institute","Freshly Painted Throughout","New Ceiling","Penthouse","Very Private & Quiet","Large Balcony","West Facing"]
["km000195","ARCHIVE","Family Residential",12,"Fortrose Crescent",349995,null,"Large Semi in Family Friendly Area!","Hardwood Flooring Under Broadloom Throughout Main Floor!","VICTORIA PRK/YORK MILLS"," 43°45'59.16\"N"," 79°19'32.30\"W",{"$f":"IF(ISBLANK(K137),\"\",DMS_to_Dec(K137))","v":43.766433333333332},-79.325638888888889,null,null,null,null,"28.75 x 130 Feet","$2,626.25/2008","3+1","3 Car Parking","1x4, 1x3",null,null,"Aug. 2009/TBA","Fenside Public School","Donview Middle School","George S. Henry Academy","Roof ‘04","100 Amp Service","Central Air Conditioning","Main Floor Has Hardwood Under Broadloom"]
["km000196","ARCHIVE","Condo",10,"Leith Hill Road #43",265500,null,"Immaculate & Spacious!","Very Large 3 Bedroom Townhome!","SHEPPARD/DON MILLS"," 43°46'36.80\"N"," 79°21'4.55\"W",43.776888888888891,-79.35126388888888,null,null,null,null,null,"$1951.08/2008","3+1","1 Parking Spot (#18)","1 x 4, 1 x 2","$380.13/mo (includes water, basic cable, grass cutting, parking, outdoor pool, common elements & building \ninsurance",null,"30 Days or TBA","Dallington P.S","Woodbine JHS","George Vanier SS","Immaculate and Private","Lots of Storage","Central Air Conditioning","Private Garden Oasis","Floor to ceiling windows"]
["km000197","ARCHIVE","Condo",20,"Brookmill Blvd #131",185000,null,"Bring a Flashlight!!","Needs a Little Tender Care!","WARDEN/FINCH"," 43°48'5.48\"N"," 79°18'55.49\"W",43.801522222222218,-79.315413888888884,null,null,null,null,null,"1732.35/2008",3,"1 Parking Spot (#131)","1 x 4, 1 x 2 ","$190/mo (includes water, parking, common elements and building insurance)",null,"30 Days or TBA"]
["km000198","ARCHIVE","Condo",40,"Homewood Avenue #1108",137900,null,"Great Location!","Attention Bachelors!","JARVIS/CARLTON"," 43°39'51.43\"N"," 79°22'29.84\"W",43.66428611111111,-79.374955555555545,null,null,null,null,null,"$1,198.64/2008",null,null,"1x4","$296.72 (includes: heat, hydro, water, cable, building insurance & common elements)","1,#25","30 Days/TBA"]
["km000199","SOLD","Executive",253,"Banbury Road",789900,null,"Right Across from Ames Park!!","In The Sought After Neighbourhood of \"The Denlow Estates\"","YORK MILLS/LESLIE"," 43°45'3.05\"N"," 79°21'53.33\"W",43.75084722222222,-79.364813888888889,null,null,null,null,"53 x 118 Feet","$5,861.98/2008",4,"Double Car Garage + 4 Car Parking","2 x 4, 1 x 2 Piece",null,null,"Immediate or TBA","Denlow Public School","Windfields Junior High School","York Mills Collegiate Institute","Main Floor Family Room","Main Floor Laundry Room","Freshly Painted Throughout","New Window Wells","200 Amp Service","Furnace '95","Central Air Conditioning"]
["km000200","ARCHIVE","Family Residential",89,"Roanoke Road",469900,null,"Immaculate Home from Top to Bottom!","Schools, Shops and Park Are Only Minutes Away!","LAWRENCE/UNDERHILL"," 43°44'35.98\"N"," 79°19'8.04\"W",{"$f":"IF(ISBLANK(K142),\"\",DMS_to_Dec(K142))","v":43.743327777777779},-79.318899999999999,null,null,null,null,"60 X 100 Feet","$3,368.45/2008",3,"Single Car Garage +2 Car Parking","1x4, 1x2",null,null,"60 to 90 Days/TBA","Cassandra Public School & Ranchdale Public School","Milne Valley Middle School","Victoria Park Collegiate Institute","New Kitchen '06","All Updated Windows","100 Amp Service '04","Puron Central Air Conditioning","Refinished Oak Flooring Throughout","Roof '92","All New Appliances '06"]
["km000201","ARCHIVE","Family Residential",98,"Roanoke Road",449900,null,"Spacious Starter Home in Don Mills!","Family Friendly Street in Sought After Area!","LAWRENCE/UNDERHILL"," 43°44'36.67\"N"," 79°19'6.23\"W",43.743519444444445,-79.318397222222217,null,null,null,null,"50 x 120 Feet","$3,315.96/2008",3,"Single Car Garage + 2 Car Parking","1x4, 1x3",null,null,"60 Days/TBA","Cassandra Public School & Ranchdale Public School","Milne Valley Middle School","Victoria Park Collegiate Institute","Roof ‘04","All Updated Windows","100 Amp Service","Central Air Conditioning","Wood Burning Fireplace"]
["km000202","SOLD","Family Residential",234,"Balliol Street",649900,null,"This is a Gem!! Don't miss out!!","Lots of $$$$ spent on upgrades!!!","YONGE/BALLIOL"," 43°41'55.72\"N"," 79°23'21.64\"W",43.698811111111105,-79.389344444444447,null,null,null,null,"21 X 103 Feet","$3,190.90/2008","3 + 1","Single Car Garage + 3 Car Parking","2 x 4, 1 x 3, 1 x 2 Piece",null,null,"Septemeber or TBA","Davisville Jr PS   ","Hodgson Sr PS  ","North Toronto CI  ","Backs onto Greenbelt","New & Replaced Windows","Lower Level Totally Renovated","Refinished Hardwood Flooring","Furnace and Central Air Conditioning 2007","Interlocking Double Driveway"," Steps to Mount Pleasant, Bayview & Yonge Street Shopping & Restaurants"]
["km000203","ARCHIVE","Condo",205,"The Donway West #306",288800,null,"Live in the Heart of Don Mills! Steps to TTC, DVP & Walk to The New Shops at Don Mills!","Large Wrap-Around Balcony!","DON MILLS/LAWRENCE"," 43°44'15.54\"N"," 79°20'44.71\"W",{"$f":"IF(ISBLANK(K145),\"\",DMS_to_Dec(K145))","v":43.737650000000002},-79.345752777777776,null,null,null,null,null,"$1,968.58/2008",2,"1 Car Parking (#B92)","1x4, 1x3","$521.21/mo includes heat, hydro, water, building insurance, parking & common elements","1 Locker #B231","30 Days/TBA","Greenland PS */ Norman Ingram PS ","Don Mills MS ","Don Mills CI","Stainless Steel Appliances","Large Wrap-Around Balcony","Ensuite Laundry","Walk to Shops & Restaurants","TTC, Sheppard or Yonge Subway Line, DVP & Highway 401 "]
["km000204","ARCHIVE","Condo",56,"Three Valleys Drive #6",252500,null,"Steps to Walking Trails, TTC & DVP!","Spacious Living in Sought After Neighbourhood!","DON MILLS/YORK MILLS"," 43°45'7.39\"N"," 79°20'8.23\"W",43.752052777777777,-79.335619444444433,null,null,null,null,null,"$1819.88/2008",2,"1 Car Parking","1 x 4 Piece","$325.58/mo (includes Water, Cable, Building Insurance, Common Elements & Parking)",null,"60 Days or TBA","Three Valleys PS   ","Milne Valley MS  ","George S Henry Academy  ","Lots of Storage","Walk-out To Lush Garden","Minutes to the New Shops on Don Mills","Hardwood Flooring on Main and Second Level"]
["km000205","SOLD","Family Residential",43,"Wallingford Road",529900,null,"Gorgeous Lot Backing on to Park!","Updated from Top to Bottom! Move In & Enjoy!","YORK MILLS/DVP"," 43°45'25.12\"N"," 79°19'28.12\"W",43.756977777777777,-79.324477777777773,null,null,null,null,"56 x 137 Feet","$4,006.78/2009",3,"1.5 Car Garage + 2 Car Parking","1x4, 1x3",null,null,"October 2009/TBA","Ranchdale Public School","Donview Middle School","Victoria Park Collegiate Institute","Original Owner","Kitchen ‘03","Two Updated Bathrooms ’04 & ‘01","Central Air Conditioning ‘07","Furnace ‘07","Roof ‘99","100 Amp Service","Pot Lights Throughout Except Bedrooms","Interior Painted ‘06","Argon Filled Pella Windows With Removable Screens Throughout Main Floor","Custom Window Sills Throughout"]
["km000206","ARCHIVE","Family Residential",16,"Norwin Street",435500,null,"Hot Location! Super Investment!","Great for First Time Buyer!","BATHURST/FINCH"," 43°47'8.64\"N"," 79°25'42.32\"W",43.785733333333333,-79.428422222222224,null,null,null,null,"64.11 x 114 Feet","$3,596.86/2008",3,"Single Car Garage + 2 Car Parking","1x4",null,null,"Immediate/TBA","RJ Lang Elementary & Middle Schools","RJ Lang Elementary & Middle Schools","Newtonbrook Secondary School","100 Amp Service","Steps to Yonge Street Shopping","TTC, Yonge Subway Line & Hwy 401","Wheelchair Access Ramp","Side Door Entry"]
["km000207","SOLD","Family Residential",4,"Barnwood Court",1399900,null,"Spacious 2 Storey Home on Sought After Quiet Cul-de-Sac!","Beautifully Landscaped Front & Back Gardens!","DON MILLS/YORK MILLS"," 43°45'9.86\"N"," 79°20'21.27\"W",43.752738888888892,-79.339241666666666,"http://tours.advirtours.com/112414P",null,null,null,"90 x 132.78 Feet","$7,212.21/2009","6 + 1","Double Car Garage + 4 Car Parking","1x6, 1x4, 1x3, 2x2",null,null,"30 Days/TBA","Three Valleys PS   ","Milne Valley PS","George S. Henry Academy","200 Amp Service","Two Updated Furnaces","Two Updated Central Air Conditioners","Roof ‘99","Central Vacuum","Three Walk-outs","Two Fireplaces","Main Floor Family Room","Main Floor Laundry Room","Mostly Updated Windows","Underground Sprinkler System in Front & Back Yards"]
["km000208","ARCHIVE","Family Residential",991,"Grafton Court",699900,null,"Located on Private Cul-De-Sac! No Toronto Land Transfer Tax!","Professionally Landscaped ‘08 with Underground Sprinkler System &Cascading Rock River in Backyard","FINCH/WHITES ROAD",null,null,"","",null,null,null,null,"59.19 x 108.33 Feet","$8,948.93/2009","5+1","Double Car Garage + 4 Car Parking","2x5, 2x3, 1x2",null,null,"60/90/TBA",null,null,null,"Octagon Skylight","Large Family Size Eat-in Kitchen ","Two Kitchens","Oval Step-up Jacuzzi Spa Tub in Master En-suite & Separate Shower","Oak Hardwood Throughout Main Floor","3 Fireplaces","Stainless Steel Appliances & Granite Counters ","Walk-out to Deck from Kitchen","Main Floor Laundry with Access to Garage","Central Vacuum","Alarm System (Monthly No Contract)","Roof Shingles ‘06","Large Workshop on Lower Level","Walk-out to Patio from Lower Level","3570 sq ft plus 1650 on Lower Level"]
["km000209","ARCHIVE","Condo",1350,"York Mills Road #1604",159900,null,"Breath Taking Toronto Skyline Views!","Commuters Paradise! Steps to All Amenities!","YORK MILLS/VICTORIA PARK"," 43°45'47.59\"N"," 79°19'9.22\"W",{"$f":"IF(ISBLANK(K151),\"\",DMS_to_Dec(K151))","v":43.763219444444445},-79.319227777777769,null,null,null,null,null,"$1,181.73/2009",1,"1 Parking Spot #A29","1x4","$348.88/mo includes: Water, parking, building insurance & common elements)",null,"Sept. 2009/TBA",null,null,null,"New Bathroom ‘06","New Flooring ‘03","New Kitchen ‘04","Large Balcony with Panoramic View of Downtown","Condo is Networked Throughout (Internet)","Large Ensuite Laundry Room","Ample In-Suite Storage","Well Maintained Building","Adopt-a-Pot Garden Program"]
["km000210","ARCHIVE","Family Residential",15,"Briarfield Drive",559900,2200,"3 Bedroom Home in The Heart of Don Mills!!","Schools, Shops, Transportation and Parks Are Only Steps Away!","LAWRENCE AND DON MILLS"," 43°44'19.00\"N"," 79°20'22.87\"W",43.738611111111112,-79.339686111111106,null,null,null,null,"65 x 106.58",null,3,"Single Car Garage + 3 Car Parking","1 x 4, 1 x 2 Piece",null,null,"Immediate or TBA",null,null,null,"Floors Refinished in August 2009","Quiet Cul-de-Sac","Freshly Painted July 2009","Hardwood Flooring in Living and Dining Room"]
["km000211","ARCHIVE","Family Residential",37,"Coral Cove Crescent",499900,null,"Rare Large Don Mills Lot! ","Renovated from Top to Bottom! This is a Gem!","LAWRENCE/UNDERHILL"," 43°44'38.76\"N"," 79°18'59.63\"W",43.744100000000003,-79.316563888888879,null,null,null,null,"43 x 140 Feet","$3,493.92/2008","3+2","Single Car Garage + 2 Car Parking","1x4, 1x3",null,null,"30 - 60 Days/TBA","Broadlands Public School (French Immersion),Cassandra Public School & Ranchdale Public School","Milne Valley Middle School","Victoria Park Collegiate Institute","Updated Windows '03,'05 & '07","Furnace '05","Roof '00","Central Air Conditioner '00 & Coil '05","New 100 Amp Circuit Breakers","Renovated Kitchen","Renovated Lower Level ","Large Extended Lot","Two New Bathrooms"]
["km000212","ARCHIVE","Family Residential",1,"Lionel Heights Crescent",489900,null,"Spacious Bungalow with Rare 3 Piece Master Ensuite Bathroom!","Super Potential in this 3+2 Bedroom! Great Location! ","LAWRENCE/UNDERHILL"," 43°44'49.97\"N"," 79°19'13.13\"W",{"$f":"IF(ISBLANK(K154),\"\",DMS_to_Dec(K154))","v":43.747213888888886},-79.32031388888889,null,null,null,null,"55 x 109.95 Feet","$3,524.37/2008","3+2","Single Car Garage + 3 Car Parking","1x4, 1x3",null,null,"Immediate/TBA","Broadlands Public School (French Immersion),Cassandra Public School & Ranchdale Public School","Milne Valley Middle School","Victoria Park Collegiate Institute","Mostly Updated Windows","Two Updated Bathrooms","Three Piece Master Ensuite Bathroom","Eat-in Kitchen with Walk-out","100 Amp Service"]
["km000213","ARCHIVE","Condo",205,"The Donway West #613",null,1500,"Luxury Low Rise in Don Mills \"The Hemingway\"","Steps to McEwans, Shops at Don Mills, TTC, DVP & Highway 401!","DON MILLS/LAWRENCE"," 43°44'15.70\"N"," 79°20'44.64\"W",43.737694444444443,-79.345733333333328,null,null,null,null,null,null,"1+1","Underground Parking: 2 Spots","1x4",null,"1: #199","Sept.19/2010 or TBA",null,null,null,"Hardwood Flooring Throughout!","Living has Walk-out to Private Balcony!","Granite Countertop in Kitchen!","Short Walk to Edwards Gardens!","Great Facilities: Rooftop Garden, 24 hour Concierge & Indoor Pool!"]
["km000214","ARCHIVE","Family Residential",485,"Brownfield Gardens",359900,null,"Surrounded by Nature this Home has Fabulous Potential!","Attention Builder's & Renovator's!","ISLAND RD/EAST AVENUE"," 43°47'53.48\"N"," 79° 8'2.21\"W",43.798188888888888,-79.133947222222233,null,null,null,null,"60 X 130 Feet","$2,682.19/2008",2,"Single Car Garage + 2 Car Parking","1x6, 1x3",null,null,"30 Days/TBA","West Rouge Junior Public School","Joseph Howe Senior Public School","Sir Oliver Mowat Collegiate Institute, Maplewood High School, Sir Robert L Borden BTI"]
["km000215","ARCHIVE","Family Residential",31,"Bessarion Road",409900,null,"Perfect Starter Home in Amazing Neighbourhood!","Commuters Paradise!","LESLIE/BESSARION"," 43°46'2.22\"N"," 79°22'32.94\"W",{"$f":"IF(ISBLANK(K157),\"\",DMS_to_Dec(K157))","v":43.767283333333332},-79.375816666666665,null,null,null,null,"30 x 120 Feet","$3,046.70/2009",4,"Single Carport + 2 Car Parking","1x4, 1x2",null,null,"Immediate/TBA","Elkhorn Public School","Bayview Middle School","Earl Haig Secondary School","Bayview Village","Fairview Mall","The New Shops at Don Mills","Ikea","Canadian Tire Super Store","North York General Hospital","Go Station","Bessarion Subway Station","TTC","Highway 401 & DVP"]
["km000216","ARCHIVE","Family Residential",7,"Sulkara Court",1098000,null,"Quiet Crescent! Renovated & Move in Ready!","Backs on to Gorgeous Ravine!","VICTORIA VILLAGE"," 43°43'54.35\"N"," 79°19'23.33\"W",43.731763888888892,-79.323147222222218,null,null,null,null,"60 x 183.8 Feet","$5,496.24/2009","2+2","Double Car Garage + 4 Car Parking","1 x 4, 2 x 3, 1 x 2",null,null,"60-90 Days/TBA","Victoria Village Public School","Milne Valley Middle School","Victoria Park Collegiate Institute","200 Amp Service","Central Vacuum","Roof 2003","Furnace  1999","Central Air Conditioning 1999","Backs on to Ravine"]
["km000217","SOLD","Family Residential",15,"Caronport Crescent",629900,null,"Renovated from Top to Bottom!","Rare Large Pie Shaped Lot with Beautiful Perennial Garden & In-ground Pool","LAWRENCE/UNDERHILL"," 43°44'38.59\"N"," 79°19'8.08\"W",43.744052777777782,-79.318911111111106,null,null,null,null,"40.5 x 126 Feet (Per Assessment)","$3,876.43/2009","2+1","Single Car Garage + 3 Car Parking","1x4, 1x3",null,null,"90-120 Days/TBA","Cassandra Public School, Ranchdale Public School & Broadlands Public School (French Immersion)","Milne Valley Middle School","Victoria Park Collegiate Institute","Exceptionally large Pie Shaped Lot with beautiful perennial garden","Renovated Kitchen ‘03","Updated Bathrooms","Hardwood Flooring Throughout","Roof ‘00","Eaves ‘06","100 Amp Service","Central Vacuum ‘03","All Updated Windows","Upper Level Wired for Surround Sound with Bose speakers, receiver and SACD player"]
["km000218","SOLD","Condo",109,"Front Street East #1003",399900,null,"Live in the Heart of Toronto! Steps to St. Lawrence Market!","Spacious 2+1 with Fantastic City Views!","FRONT ST. E./LOWER JARVIS"," 43°38'57.45\"N"," 79°22'16.16\"W",43.649291666666663,-79.371155555555546,null,null,null,null,null,"$2,658.37/2009","2+1","1 Underground, #B27","1x4, 1x3","$486.54/Mo (includes: water, heat, hydro central air, parking, building insurance & common elements)","1, #BL44","Immediate/TBA",null,null,null,"Hardwood Flooring Throughout '06","Granite Countertops in Kitchen with Breakfast Bar","Fantastic City Views","In Your Neighbourhood:","St. Lawrence Market","The Esplanade","David Crombie Park","The St. Lawrence Community Recreation Centre","Union Station, TTC, GO Transit & Via Rail","The Gardiner Expressway & DVP","Steps to Restaurants & Shopping"]
["km000219","SOLD","Family Residential",65,"Three Valleys Drive",499900,null,"Prestigious Donalda Golf Course Neighbourhood!","Super Family Home Steps to Schools, Parks, TTC, DVP & Hwy 401!","YORK MILLS/DON MILLS"," 43°45'2.72\"N"," 79°20'12.21\"W",{"$f":"IF(ISBLANK(K161),\"\",DMS_to_Dec(K161))","v":43.750755555555557},-79.336725000000001,null,null,null,null,"63 x 105 Feet","$4,331.60/2009","3+1","Single Car Garage  + 4 Car Parking","1x4, 1x2",null,null,"90 Days/TBA","Three Valleys Public School,Cassandra Public School, Ranchdale Public School & Broadlands Public School (French Immersion)","Milne Valley Middle School","Victoria Park Collegiate Institute","Roof ‘03","100 Amp Service","Central Air Conditioning","Furnace ‘97","In Your Neighbourhood","Minutes to The New “Shops at Don Mills”","Short walk to Donwoods Plaza","Donalda Golf and Country Club","Broadlands Community Centre with Pool , Ice Rink & Parks","Broadlands Public School (Fr. Immersion)","Annunciation Catholic School","Cassandra Public School","Ranchdale Public School","Milne Valley Middle School","Victoria Park High School","Crestwood Preparatory College","Senator O’Connor High School","TTC, DVP & Highway 401"]
["km000220","SOLD","Family Residential",134,"Three Valleys Drive",459900,null,"Gorgeous Perennial Garden with Spacious Deck Overlooking The Ravine","Rare 4 Bedroom Semi with Garage in the Quiet and Sought After Donalda Neighbourhood!","YORK MILLS/DON MILLS"," 43°44'49.31\"N"," 79°20'11.55\"W",43.747030555555554,-79.336541666666662,null,null,null,null,"36 x 115 Feet","$3,511.01/2009",4,"Single Car Garage + 2 Car Parking","1 x 4, 1 x 2 Piece",null,null,"60-90 Days or TBA","Three Valleys Public School,Cassandra Public School, Ranchdale Public School & Broadlands Public School (French Immersion)","Milne Valley Middle School","Victoria Park Collegiate Institute","Furnace ‘08’","Observation Deck Overlooks Donalda Ravine","Beautiful Perennial Garden","Newer Windows","Updated Bathrooms","In Your Neighbourhood","Minutes to The New “Shops at Don Mills”","Short walk to Donwoods Plaza","Donalda Golf and Country Club","Broadlands Community Centre with Pool , Ice Rink & Parks","Broadlands Public School (Fr. Immersion)","Annunciation Catholic School","Cassandra Public School","Ranchdale Public School","Milne Valley Middle School","Victoria Park High School"]
["km000221","ARCHIVE","Family Residential",11,"Sandpiper Court",929900,null,"Super Sized Pie Shaped Lot!","Prime Donalda Location! Spacious Bungalow Backing on to Park!","YORK MILLS/DON MILLS"," 43°45'17.54\"N"," 79°20'17.43\"W",43.754872222222225,-79.338174999999993,null,null,null,null,"Front: 51 Feet, Depth: 133 Feet & Rear: 192 Feet ","$6,109.55/2009",3,"Double Car Garage + 4 Car Parking ","2x4",null,null,"90-120 Days/TBA","Three Valleys Public School","Milne Valley Middle School","George S Henry Academy  ","Super Size  Pie Shaped Lot","Backs on to Park","Newer Central Air Conditioning","Roof ‘05","Furnace ‘07","TTC, DVP & Highway 401","Ten Minutes to Downtown Toronto"]
["km000222","SOLD","Condo",81,"Crimson Millway",549900,null,"Fantastic Opportunity in Great Location!","Spacious 2 Story Townhouse in High Demand Neighbourhood!","YORK MILLS/BAYVIEW"," 43°45'5.95\"N"," 79°22'51.02\"W",{"$f":"IF(ISBLANK(K164),\"\",DMS_to_Dec(K164))","v":43.751652777777778},-79.380838888888889,null,null,null,null,null,"$3,543.07/2009",3,"Single Car Garage + Single Car Parking","1x4, 2x2","$366.09/mo (includes: water, parking, building insurance & common elements)",null,"60 Days/TBA","Harrison Public School","Windfields Junior High School","York Mills Collegiate Institute, Northern Secondary School","Stair Railing ‘08","Under Padding Re-done ‘09","York Mills Plaza","Yonge/York Mills Subway Line","York Mills TTC Line","York Mills Arena","York Mills Park","Steps to Bayview Village"]
["km000223","ARCHIVE","Condo",81,"Northern Heights Drive #28A",333300,null,"Great Starter Home!","Newer Construction Steps to All Amenities!","YONGE/16th"," 43°51'4.43\"N"," 79°25'48.50\"W",43.85123055555556,-79.430138888888891,null,null,null,null,null,"$2,978.88/2009",3,"Single Car Garage + Single Car Parking","2x4, 1x2","$215/Mo (includes water, parking, building insurance & common elements)",null,"November 2009/TBA","Charles Howitt Elementary School","Charles Howitt Elementary School","Langstaff High School","Built by Daniels Group‘97","Central Air Conditioning","100 Amp Service","Spacious Three Storey Home","Hillcrest Mall","South Hill Shopping Centre","Richmond Hill Shopping Centre","Richmond Hill Golf & Country Club","Richmond Hill Montessori School","Dr. James Langstaff Community Centre","Richvale Athletic Park & Community Centre","Highway 404/DVP & 407 ETR"]
["km000224","ARCHIVE","Family Residential",8,"Ethelwin Avenue",549900,null,"Renovated from Top to Bottom! Including Family Sized Deck!","Steps to Danforth Shopping & The Beach!","DANFORTH/WOODBINE"," 43°41'5.11\"N"," 79°18'33.77\"W",43.684752777777774,-79.309380555555549,null,null,null,null,"20 x 90 Feet","$2,942.58/2009","3+1",null,"1x4,1x3",null,null,"90-120 Days/TBA","Gledhill Junior Public School","Earl Beatty Junior & Public School","Monarch Park Collegiate Institute, Eastern Commerce Collegiate Institute, Danforth C&TI School\n","New Kitchen ‘07","New two-tier Trex Premium Composite deck with built-in seating & lighting ‘09","Mostly Updated Windows","Eight Inch Georgian Baseboards, Trim & Moldings","Series 800 Paneled Interior Doors","Three Quarter Inch Main Water Feed","Steel Insulated Front & Back Doors","Re-shingled Roof ‘05/ ‘06","Flat Roof '05/ '06","200 Amp Service","Finished Lower Level with Separate Entrance","California Shutters Throughout ‘07","Updated Bathrooms",null,"Central Air Conditioning"]
["km000225","ARCHIVE","Family Residential",1,"Shouldice Court",628800,null,"Large Updated Family Bungalow with Beautiful Gardens","Updated & Move-in Ready! Super Sought After Neighbourhood!","LESLIE/BANNATYNE"," 43°45'45.18\"N"," 79°21'56.18\"W",43.762549999999997,-79.365605555555547,null,null,null,null,"55 x 120 Feet","$4.113.63/2009","3+1","Single Car Garage + 2 Car Parking","1x4, 1x3",null,null,"Jan.8/2010","Dunlace Public School","Windfields Junior High School","York Mills Collegiate Institute, Northern Secondary School","Roof ’09 ","Central Air Conditioning ‘04","100 Amp Service","Aprilaire Humidifier","Central Vacuum","Two Gas Fireplaces","Mostly Updated Windows","Garage Door Opener ‘09"]
["km000226","ARCHIVE","Family Residential",34,"Groveland Crescent",599900,null,"Super Huge Lot on Sought After Street!","Hardwood Flooring Throughout Main Floor! Spacious Bungalow!","DON MILLS/YORK MILLS"," 43°44'59.89\"N"," 79°20'7.25\"W",{"$f":"IF(ISBLANK(K168),\"\",DMS_to_Dec(K168))","v":43.749969444444446},{"$f":"IF(ISBLANK(L168),\"\",DMS_to_Dec(L168))","v":-79.335347222222211},null,null,null,null,"79.4 x 203 Feet","$4,117.91/2009",3,"Double Car Garage + 4 Car Parking","1x4, 1x2",null,null,"60 Days/TBA","Broadlands Public School (Fr. Immersion)\nAnnunciation Catholic School \nThree Valleys Elementary School\nCassandra Public School\nRanchdale Public School\n","Milne Valley Middle School","Victoria Park High School\nCrestwood Preparatory College\nSenator O’Connor High School\n","100 Amp Service","Chimney Re-built ‘06","Rare Deep Lot","In Your Neighbourhood","Minutes to The New “Shops at Don Mills”","Short walk to Donwoods Plaza","Donalda Golf and Country Club","Broadlands Community Centre with Pool , Ice Rink & Parks","TTC, DVP & Highway 401"]
["km000227","ARCHIVE","Family Residential",66,"Mortimer Crescent",499900,null,"Eagle Ridge Model Built by John Boddy Homes","The Quiet Street Is The Only Crescent In The Neighbourhood! Safe And Child Friendly!","ELIZABETH/HIGHWAY 2"," 43°51'29.21\"N"," 79° 3'56.60\"W",{"$f":"IF(ISBLANK(K169),\"\",DMS_to_Dec(K169))","v":43.858113888888887},{"$f":"IF(ISBLANK(L169),\"\",DMS_to_Dec(L169))","v":-79.06572222222222},null,null,null,null,"45.44 x 109.91 Feet","$6,282.62/2008",4,"Double Car Garage + 2 Car Parking","2 x 5, 2 x 2 Piece",null,null,"30 Days or Tba","Eagle Ridge Public School",null,"Pickering High School","Historic Pickering Village Location","Eagle Ridge Model Built By John Boddy Homes","Mortimer is the Only Crescent in the Community","Quiet Crescent","Nine Foot Ceilings","Roof ‘09 with 30 Year Transferable Warranty for Shingles","High-Efficiency Furnace","Central Air Conditioning","Electronic Air Cleaner","Roughed-in Central Vacuum","100 Amp Service","Custom 3,400 Square Foot Home","Extended Family Room & Basement Level","Maintenance-Free Vinyl Clad Windows Throughout"]
["km000228","ARCHIVE","Family Residential",7,"Sundial Crescent",499900,null,"Original Owner! Super Starter Home!","Updated & Move-in Ready! Steps to Schools. Parks, TTC, DVP, 401 & Subway!","VICTORIA/VILLAGE"," 43°44'0.41\"N"," 79°19'16.97\"W",{"$f":"IF(ISBLANK(K170),\"\",DMS_to_Dec(K170))","v":43.733447222222225},-79.32138055555555,null,null,null,null,"42 X 142 Feet","$3,823.01/2009",3,"Double Car Garage + 6 Car Parking","1x4, 1x3, 1x2",null,null,"30 Days/TBA","Sloane Public School \nEcole Jeanne-Lejoie Elementary French Public School\n","Milne Valley Middle School","Victoria Park Collegiate Institute","Original Owner","Furnace ‘07","Central Air Conditioning ‘07","100 Amp Service","Roof ‘00 ","Underground Sprinkler System"]
["km000229","ARCHIVE","Family Residential",3,"Farmcote Road",569900,null,"Donalda Golf & Country Club Neighbourhood!","Spacious and Great Floor Plan! All Amenities at Your Fingertips! ","DON MILLS/LAWRENCE"," 43°44'42.97\"N"," 79°20'40.17\"W",43.745269444444446,-79.344491666666656,null,null,null,null,"115.04 x 106.26","$3,949.09/2009","3+1","Carport + 3 Car Parking","1x4, 1x3",null,null,"January 15/2009","St. Bonaventure Catholic School,\nNorman Ingram Elementary School, Greenland Public School\n","Don Mills Middle School","Don Mills Collegiate Institute","Roof ‘99","Central Air Conditioning ‘97","Furnace ‘97","100 Amp Service","Cathedral & Nine Foot Ceilings Throughout"]
["km000230","ARCHIVE","Family Residential",39,"Valentine Drive",779900,null,"Like New! Completely Renovated From Top to Bottom!","This Home has it All! Move-in & Enjoy!","DON MILLS/YORK MILLS"," 43°45'36.52\"N"," 79°20'29.32\"W",43.760144444444443,-79.341477777777769,null,null,null,null,"62.79x 120 Feet","$4,271.77/2009","3+1","Double Car Garage + 2 Car Parking","2x4, 1x3",null,null,"Immediate/TBA","Rene Gordon Elementary School","Donview Middle School","George S Henry Academy  ","Completely Renovated ‘09","Central Vacuum ‘09","100 Amp Service ‘09","Kitchen ‘09","Stainless Steel Appliances ‘09","Stucco Exterior with 1 ½ Styrofoam","Central Air Conditioning ‘09","High Efficiency Furnace ‘09","Aluminum Soffits & Fascia ‘09","Eaves ‘09","Roof Replaced & Re-Shingled ‘09","All Windows ‘09","Weeping Tile ‘09","Waterproofed Foundation ‘09","Refinished Hardwood Flooring Throughout Main Floor ‘09"]
["km000231","ARCHIVE","Family Residential",33,"Celeste Drive #14",155900,null,"Super Starter Home Steps tp TTC & Go Train!","Needs TLC!","KINGSTON/GUILDWOOD"," 43°45'27.39\"N"," 79°12'0.20\"W",{"$f":"IF(ISBLANK(K173),\"\",DMS_to_Dec(K173))","v":43.75760833333333},-79.200055555555565,null,null,null,null,null,"$1518.06/2009",3,"Single Car Garage + 1 Car Parking","1x4, 1x2","$207/mo (includes: water, building insurance, parking & common elements)",null,"30 Days/TBA","Galloway Road Public School","Galloway Road Public School","Sir Wilfred Laurier Collegiate Institute, Sir Robert L Borden BTI, Maplewood High School"]
["km000232","SOLD","Family Residential",13,"Norden Crescent",699900,null,"Steps to Shops at Don Mills! Sun Filled & Updated!","Cathedral Ceilings! Open Concept!","DON MILLS/LAWRENCE"," 43°44'14.09\"N"," 79°21'0.87\"W",43.737247222222223,-79.350241666666662,null,null,null,null,"44.46 x 130 Feet Rear: 72 Feet Irregular","$3771.7/2009","2 + 1","Single Car Garage + 4 Car Parking","1x4, 1x3, 1x2",null,null,"30 Days/TBA","Greenland Public School, Norman Ingram Public School","Don Mills Middle School","Don Mills Collegiate Institute","Central Air Conditioning","Furnace ‘07","All New Windows","New Kitchen","All New Bathrooms","100 Amp Service"]
["km000233","SOLD","Condo",555,"Yonge Street #709",324900,null,"Downtown Living in Spacious 2 Bedroom Condo!","Updated & Move-in Ready! Eastern Unobstructed Views!","YONGE/WELLESLEY"," 43°39'53.22\"N"," 79°23'3.12\"W",43.664783333333332,-79.384200000000007,null,null,null,null,null,"$1,916.85/2009",2,"1 Underground Parking Spot (F3)","1x4, 1x3","$651.99/mo (includes water, heat, hydro, central air conditioning, building insurance, parking & common elements)",null,"60/90 Days/TBA",null,null,null,"9 Foot Ceilings","Unobstructed Eastern Views","Locker on Same Floor","Stainless steel appliances","Short walk to Eaton Centre, Yorkville, Ryerson & University of Toronto","Steps to TTC & Subway","Newly Updated Throughout","Amenities: 24 hour concierge, Recreation & Meeting/Party Room, Exercise Room, Sauna, 2 Rooftop Patios + BBQ"]
["km000234","SOLD","Condo",30,"Gloucester Street #1803",204900,null,"Steps to Yorkville, TTC & Subway!","Refinished Parquet Flooring & Freshly Painted!","YONGE/GLOUCESTER"," 43°40'0.86\"N"," 79°23'1.77\"W",43.666905555555552,-79.383825000000002,null,null,null,null,null,"N/A (Included in Maintenance fee)",1,"1 Underground (to be redesignated by the building)","1x4","$599.43 (includes heat, hydro, water, taxes, parking, building insurance & common elements)",null,"Immediate/TBA",null,null,null,"In Your Neighbourhood","Yonge & Bloor Street Shopping","Steps to Yorkville","Fabulous Restaurants","Whole Foods on Avenue Road","Subway & TTC","Amenities: Exercise Room, Common Locker"]
["km000235","ARCHIVE","Family Residential",19,"Lausanne Crescent",429900,null,"Sought After Quiet Neighbourhood! Backs on to Park!","Spacious & Updated Throughout!","POPLAR/GUILDWOOD VILLAGE"," 43°45'15.42\"N"," 79°11'19.86\"W",{"$f":"IF(ISBLANK(K177),\"\",DMS_to_Dec(K177))","v":43.754283333333333},-79.188850000000002,null,null,null,null,"45 x 111.56 Feet ","$2850.69/2009  ",5,"Single Car Garage + 2 Car Parking ","2x4, 1x2",null,null,"March 31/2010","Poplar Road Junior Public School                                               ","Jack Miner Senior Public School","Sir Wilfred Laurier Collegiate Institute,\nSir Robert L. Borden BTI,\nMaplewood High School","High Efficiency Furnace ‘08","Central Air Conditioner ‘08","Vacuflo Central Vacuum ‘06","Backs on to Park","Refinished Hardwood flooring ‘04","New 100 Amp Circuit Breakers","Some Updated Windows                                             "]
["km000236","ARCHIVE","Family Residential",51,"Overture Road",199900,null,"Renovators Delight! Needs TLC!","Steps to TTC, GO Station, Shops & Restaurants","KINGSTON/LAWRENCE"," 43°45'39.57\"N"," 79°11'57.11\"W",43.760991666666669,-79.199197222222224,null,null,null,null,"47.5 x 60 Feet","$1,831.48/2009",3,"3 Car Parking","1x4",null,null,"30 Days/TBA","Galloway Road Public School","Galloway Road Public School","Sir Wilfred Laurier Collegiate Institute, Maplewood High School"]
["km000237","ARCHIVE","Family Residential",33,"Overbank Crescent",549900,null,"Never Been Used Hardwood Flooring Throughout!","Spacious & Located in Sought After Neighbourhood!","DON MILLS/YORK MILLS"," 43°45'18.25\"N"," 79°19'26.55\"W",43.755069444444445,-79.324041666666659,null,null,null,null,"65 x 100 Feet","$3,942.68/2009",3,"Car Garage + 3 Car Parking","1x4, 1x2",null,null,"Immediate/TBA","Ranchdale Public School","Milne Valley Middle School","Victoria Park Collegiate Institute","In Your Neighbourhood","Surrounded by Ravines & Walking Paths","Minutes to The New “Shops at Don Mills”","Donalda Golf and Country Club","Broadlands Community Centre with Pool , Ice Rink & Parks","Broadlands Public School (Fr. Immersion)","Annunciation Catholic School",null,null,null,"Milne Valley Middle School","Victoria Park High School","Crestwood Preparatory College","Senator O’Connor High School","TTC, DVP & Highway 401"]
["km000238","ARCHIVE","Family Residential",73,"Lionel Heights Crescent",499900,null,"Spacious & Wonderfully Maintained!","Super Family Home in Great Family Location!","LAWRENCE/UNDERHILL"," 43°44'56.01\"N"," 79°18'54.08\"W",{"$f":"IF(ISBLANK(K180),\"\",DMS_to_Dec(K180))","v":43.748891666666665},-79.315022222222225,null,null,null,null,"55 x 112 Feet","$3,577.26/2009",4,"Single Car Garage + 3 Car Parking","1x4, 1x3",null,null,"Probate Date","Broadlands Public School (French Immersion),Cassandra Public School & Ranchdale Public School","Milne Valley Middle School","Victoria Park Collegiate Institute","Refinished Hardwood Flooring Throughout Main & Upper Level","100 Amp Service","Roof Approximately ‘04","Furnace ‘01"]
["km000239","ARCHIVE","Condo",25,"Silver Springs",160500,null,"Close to Schools, Park, TTC, Grace Hospital and Hwy 401","End Unit with Balcony","BIRCHMOUNT/FINCH"," 43°45'30.46\"N"," 79°21'44.96\"W",43.75846111111111,-79.362488888888876,null,null,null,null,null,"$1410.39/2009","2+1","1 Underground Parking Spot","2 x 4 ","539.63/mo",null,"30 Days /TBA"]
["km000240","ARCHIVE","Family Residential",162,"Bannatyne Drive",null,3600,"Super Family Home in Demand Area!","Executice 2 Story Home with Large Parklike Lot!","LESLIE/YORK MILLS"," 43°45'29.92\"N"," 79°21'44.94\"W",43.758311111111112,-79.36248333333333,null,null,null,null,"70 X 120 Feet",null,5,"Double Car Garage + 6 Car Parking","1x5, 2x4, 1x2",null,null,"Immediate","Dunlace Public School","Winfields Junior High School","York Mills Collegiate Institute","Second Floor Landing has Skylight","Main Floor Family Room, Library & Laundry","Large Principal Rooms","Walk to Schools, TTC, Shops, Restaurants, GO Station, Tennis & Parks","Easy Access to Highway 401 & DVP","All New Appliances to be Installed"]
["km000241","ARCHIVE","CONDO",120,"Dallimore Circle PH908",369900,null,"Brand New Luxury Condo! Stunning Penthouse Suite!","2 Walkouts to Open Balcony with Breath-taking Views!","DON MILLS/GREENBELT"," 43°43'49.65\"N"," 79°19'55.98\"W",43.730458333333338,-79.332216666666667,null,null,null,null,null,"0/2010","2+1","1 Underground Spot","1 x 5, 1 x 4 Piece","$577.66/mo (includes heat, water. Central air conditioning, parking building insurance & common elements)",1,"Immediate or TBA","Greenland PS */ Norman Ingram PS ","Don Mills MS ","Don Mills Collegiate Institute","Hardwood Flooring","Close to Parks, Schools, TTC, DVP and The New 'Shops at Don Mills'","Stainless Steel Appliances","Large Sun-Filled Suite","9 Ft Ceilings","24 Hour Concierge"]
["km000242","ARCHIVE","Family Residential",1,"Beveridge Drive",579900,null,"Sought After Family Friendly Don Mills Location!","Steps to Schools, Parks, Walking Trails, TTC, DVP & Highway 401","LAWRENCE/UNDERHILL"," 43°44'51.64\"N"," 79°19'33.01\"W",{"$f":"IF(ISBLANK(K184),\"\",DMS_to_Dec(K184))","v":43.747677777777781},-79.325836111111101,null,null,null,null,"61 x 110 Feet","$4,372.95/2010",4,"4 Car Parking + Double Car Garage","2 x 4, 1 x 3 ",null,null,"May/June 2009/TBA","Ranchdale Public School","Milne Valleys Middle School","Victoria Park Collegiate Institute","100 Amp Service","Furnace 2007","Three Walk-outs","Steps to Woodbine bus, Donwood Plaza and Schools"]
["km000243","ARCHIVE","Family Residential",54,"Timberbank Blvd",249900,null,"Spacious 2 Storey Steps to Schools, Parks, Shopping & TTC.","Private Fenced Back Garden!","WARDEN/BRIDLETOWNE"," 43°47'32.18\"N"," 79°18'41.84\"W",43.792272222222223,-79.311622222222226,null,null,null,null,null,"$1820.68/2009","4+1","Single Car Garage + 1 Car Parking","1x4, 1x2","$220/mo (includes: parking, water, cable TV, common elements & building insurance)",null,"30 Days/TBA","Timberbank Junior Public School","John Buchan Senior Public School","Stephen Leacock Collegiate Institute, Sir William Osler High School","100 Amp Service","New Kitchen ","New Bathrooms","New Roof, Eaves & Soffits '07","Furnace & Central Air '00"]
["km000244","ARCHIVE","Family Residential",152,"Benjamin Blvd.",329000,null,"Renovator's Dream!","Super Potential!","MIDLAND/EGLINTON"," 43°43'53.32\"N"," 79°15'38.92\"W",43.731477777777776,-79.26081111111111,null,null,null,null,"49.98 x 101 Feet","$2238.71/2009",3,"Three Parking Spaces","1x4",null,null,"30 Days/TBA","Corvette Junior Public School","Elia Middle School","CW Jeffreys Collegiate Institute"]
["km000245","ARCHIVE","Family Residential",82,"Fenelon Drive",449900,null,"Fantastic Opportunity!","Bright and Updated Kitchen!","YORK MILLS/VALENTINE"," 43°45'40.23\"N"," 79°20'15.09\"W",{"$f":"IF(ISBLANK(K187),\"\",DMS_to_Dec(K187))","v":43.761175000000001},-79.337524999999999,null,null,null,null,"46 x 104 Feet","$2725.09/2009","3+1","2 Car Parking","1 x 4, 1 x 3 Piece",null,null,"Immediate or TBA",null,null,null,"100 Amp Service","New 3 Piece Bathroom","New broadloom in Lower Level"]
["km000246","ARCHIVE","Family Residential",19,"Southvale Drive",599900,null,"Leaside Condo Alternative!","Deep South Facing Lot! Steps to Shopping, Restaurants, TTC, Subway & DVP!","BAYVIEW/MILLWOOD"," 43°42'6.57\"N"," 79°21'44.12\"W",43.701824999999999,-79.362255555555549,null,null,null,null,"31 x 135 Feet","$4,383.02/2009","1+1","Detached Garage + 3 Car Parking","1x4, 1x3",null,null,"30 Days/TBA",null,null,null,"Newer Canac Kitchen,","Hardwood Flooring Throughout Main Floor","Updated Bathrooms","Deep South Facing Lot","100 Amp Service","Lead Windows","Central Air '02","Roof '06","Furnace'01","Finished Lower Level with Separate Entrance","Cathedral Ceilings","Skylights"]
["km000247","ARCHIVE","Family Residential",80,"Valentine Drive",749900,null,"Gorgeous Open Concept Home With City View!","Spacious& Move-in Ready!","DON MILLS/YORK MILLS"," 43°45'41.79\"N"," 79°20'38.13\"W",43.761608333333335,-79.343924999999999,null,null,null,null,"58 x 113 Feet","$4,391.44/2009","3+1","Double Car Garage + 4 Car Parking","1x5, 1x4, 1x2",null,null,"May/June/TBA","Rene Gordon Elementary School","Donview Middle School","George S Henry Academy  ","Roof’09 with Edge Drips","Underground Sprinkler System in Front & Back Gardens","200 Amps Service","Central Alarm System with Motion & Smoke Detector","Updated Windows","Modern Kitchen","South Facing Lot","Central Air with Humidifier","Furnace’99","Blower Motor’10","Control Board’08"]
["km000248","ARCHIVE","Family Residential",53,"Hurlingham Crescent",1599900,null,"One Year New!! Custom Designed and Built '09!","Wonderful Craftmanship with Extra High Ceilings!","LESLIE/YORK MILLS"," 43°45'2.52\"N"," 79°21'31.94\"W",43.750700000000002,-79.358872222222217,"http://tours.advirtours.com/114505P",null,null,null,"70 x 118 Feet","$3,743.94/2009","4+1","Double Car Garage + 4 Car Parking","2 x 5, 2 x 4, 1 x 2 Piece",null,null,"60/90 Days/TBA","Denlow Public School","Windfields JHS","York Mills Collegiate","Denlow School District!!","Custom Built 2009","Custom Gourmet Kitchen","200 Amp Service","Central Vacuum","High Ceilings Throughout","High Baseboards & Tiered Cornice Moldings Throughout","Custom Solid Wood Interior Doors","Tank-less Water Heater","Wired for Camera, Wi-Fi & Intercom with Speakers Throughout"]
["km000249","ARCHIVE","Family Residential",166,"Underhill Drive",749900,null,"Spacious Georgian Manor!","Located in Prestigious & High Demand Neighbourhood!","UNDERHILL/LAWRENCE"," 43°45'10.69\"N"," 79°19'36.90\"W",{"$f":"IF(ISBLANK(K191),\"\",DMS_to_Dec(K191))","v":43.752969444444446},-79.326916666666662,null,null,null,null,"100 x 161 Feet ","$5,094.49/09","5+2","Double Car Garage + 4 Car Parking","2x5, 1x3, 1x2",null,null,"June/TBA","Cassandra Public School","Milne Valley Middle School","Victoria Park Collegiate Institute","Main Roof’07","Garage Roof ‘05","Central Air","High Efficiency Furnace ‘97","200 Amp Service","All New Windows ’07 Except One","Two New Exterior Doors ’06 & ‘07","One Inch Main Water Pipes","Main Floor Family Room","Oversized Composite Deck","Lower Level In-Law Suite","Second Floor Laundry Room","Exceptional Neighbourhood"]
["km000250","ARCHIVE","Condo",915,"King Street West #105",289000,null,"Super Location! Steps to Shops & Restaurants!","Trendy Condo with Large Terrace!","KING ST.W./STRACHAN"," 43°38'29.28\"N"," 79°24'46.43\"W",43.641466666666666,-79.412897222222227,null,null,null,null,null,"$1645.45/09",1,null,"1x4","$317.64/mo (includes water, radiant heat, building insurance, common elements)","1 Locker: # 28","Immediate/TBA",null,null,null,"11 Foot Ceilings","Large Private Terrace","Steps to Shops & Restaurants","King Street Streetcar"]
["km000251","SOLD","Family Residential",95,"Lord Seaton Road",1190000,null,"Gorgeous & Spacious 2 Story Home in Demand Neighbourhood!","Four Walk-outs! Backs on to Quiet Park!","YONGE/YORK MILLS"," 43°45'8.82\"N"," 79°23'56.55\"W",43.752450000000003,-79.399041666666676,null,null,null,null,"70 x 110 Feet","$6754.90/2009","4+1","Double Car Garage + 2 Car Parking","1x5, 1x3, 2x2",null,null,"June/July/TBA","Owen Public School","St. Andrews Junior High School","York Mills Collegiate Institute","All Washrooms ‘07","Kitchen ‘03","Alarm System","Main Floor Laundry Room ‘03","Main Floor Family Room","Two Fireplaces","Landscaped Front ‘03 & Back Gardens ‘02","Inground Sprinkler System ‘02","Mostly New Windows Back ’02 & Front ‘04","Central Air Conditioning ‘02","Ruud Gas Furnace & General Humidifier ‘04","150 Amp Service"]
["km000252","ARCHIVE","Family Residential",2,"Averdon Crescent",629900,null,"Large 2 Story Family Home in Super Neighbourhood!","Simply Move-in & Enjoy!","LAWRENCE/UNDERHILL"," 43°44'57.93\"N"," 79°19'30.85\"W",43.749425000000002,-79.32523611111111,null,null,null,null,"58.5 x 110.5 Feet","$4,017.47/2009",4,"Double Car Garage + 4 Car Parking","1x4, 1x2",null,null,"June 2010/TBA","Ranchdale Public School Or Broadlands Public School for French Immersion","Milne Valley Middle School Or Windfields Junior High School for French Immersion","Victoria Park Collegiate Institute Or York Mills Collegiate Institute for French Immersion","Furnace ‘05","Re-Finished Hardwood Flooring & Stairs ‘02","Kitchen ‘02","Updated Bathrooms ‘02","Large Private Lot","Quiet Crescent","Roof, Gutters, Fascia & Soffits ‘99","Mostly Newer Windows","New Garage Door Opener with Two Remotes ‘09","Short Walk to Bus Stop and Library"]
["km000253","ARCHIVE","Family Residential",21,"Olsen Drive",699900,null,"The Best Sunset Views on the Street! Super Location!","Renovated from Top to Bottom! This is a Gem!","DON MILLS/YORK MILLS"," 43°45'36.68\"N"," 79°20'34.45\"W",43.760188888888891,-79.342902777777766,null,null,null,null,"50 x 120 Feet","$4,045.25/2009","2+1","Double Car Garage + 4 Car Parking","1x4, 1x3",null,null,"May 2010/TBA","Rene Gordon Elementary School","Donview Middle School","George S Henry Academy","All New Windows & Exterior Doors","Roof ‘04","Central Air Conditioning","Central Vacuum","Insulated Attic ‘09","100 Amp Service","Alarm System","New Kitchen ‘09","Updated Bathrooms"]
["km000254","ARCHIVE","Family Residential",287,"Manor Road East",699900,null,"Sought After Location! Spacious Home!","Updated Throughout! Private Parking!","BAYVIEW/EGLINTON"," 43°42'18.40\"N"," 79°23'7.02\"W",{"$f":"IF(ISBLANK(K196),\"\",DMS_to_Dec(K196))","v":43.705111111111115},-79.385283333333334,null,null,null,null,"22 x 78.25 Feet","$3,828.93/2010",3,"Private Parking","1x4, 1x3",null,null,"June/July/TBA","Maurice Cody Junior Public School","Hodgson Senior Public School","Northern Secondary School","Legal Front Parking Pad","Mitsubishi Mr. Slim Air Conditioner","Renovated Kitchen with Walk-Out to Private Backyard","Central Vacuum","100 Amp Service","Furnace’00","Freshly Painted Interior’10","New Ash Flooring Throughout Main Level’10","Updated 3/4\" Main Plumbing"]
["km000255","ARCHIVE","Condo",16,"Harrison Garden Blvd. #1501",289900,null,"Location! Location! Luxury Shane Baghai Condo!","Steps to all Amenities! Restaurants, TTC & Subway!","YONGE/SHEPPARD"," 43°45'28.58\"N"," 79°24'31.37\"W",43.757938888888887,-79.408713888888897,null,null,null,null,null,"$1,724.52/2009","1+1","1 Underground Parking Spot: P3, #10","1x4","$398.17/mo  Includes: heat, water, hydro, central air conditioning, parking, building insurance, common elements     ","#336","May 15/ 2010",null,null,null,"Shane Baghai Luxury Condominium","Bright and Spacious","Central Air Conditioning","Private Balcony with Unobstructed Northern Views","Indoor Pool","Exercise Room","Sauna","Hot Tub","Party Room","Terrace with bbqs","24 Hour Concierge","Guest Suites"]
["km000256","ARCHIVE","Cottage",null,"Lake Kabakwa",null,6000,"Brand New 4 Bedroom , All Season, Lakefront Cottage!","Backs onto 150 Acres Crown Land! An Ultimate Private Getaway!!","LAKE KABAKWA/HALIBURTON",null,null,"","",null,null,null,null,null,null,4,null,"1 x 4",null,null,null,null,null,null,"Low Season $1100/week Weekend $500 Long Weekend $75 Summer $1500\n(Christmas, New Years, March Break $2000/week)","Cathedral Ceilings and Open Concept Living Room, Dining Room and Kitchen","Wood-Burning Stove","TV/VCR/DVD player","Cozy and Comfy Furniture","Beautiful & Clear Lake for Fishing or Ice Fishing","ATV and Snowmobile Trails Nearby","Large Dock & Deck","Muskoka Chairs","Fire Pit","Propane and Charcoal BBQ's","Canoe, Kayak and Hammock","1 Queen Bed, 1 Double Bed (with tv/dvd), 1 bunk bed, I loft with double bed and separate living room ","Fully equiped kitchen","Close to the Town of Haliburton, Lake Bays & Bracebridge"]
["km000257","ARCHIVE","Family Residential",24,"Beaufield Avenue",549900,null,"This is a North of Leaside Diamond in the Rough!","Renovated To Your Own Taste! Great Space! Super Backyard with Extra Large Garage!","BROADWAY/GLENVALE"," 43°42'59.75\"N"," 79°22'12.21\"W",{"$f":"IF(ISBLANK(K199),\"\",DMS_to_Dec(K199))","v":43.716597222222227},-79.370058333333333,null,null,null,null,"25 x 135 Feet","$4367.93/2009",3,"Single Detached Garage + 1 Car Parking","1 x 4, 1 x 2 Piece",null,null,"Immediate/TBA","Northlea E & MS","Northlea E & MS","Leaside High School","Updated Roof ","Furnace '09","100 amp fuses","Central Air Conditioning","Crème de la Crème Location!"]
["km000258","SOLD","Condo",1210,"Don Mills Road",319900,null,"Southern Courtyard Views from X-Large Balcony","Approx 900 Sq Ft of Quiet and Spacious Living","DON MILLS/THE DONWAY W"," 43°44'23.84\"N"," 79°20'40.55\"W",43.739955555555554,-79.34459722222222,null,null,null,null,null,"$2181.83/2009",1,"One Underground Parking Spot (9A)","1 x 4 Piece","$535.53/mo inlcludes heat, hydro, water, air conditioning, ultimate cable, building insurance and common elements)","1 Owned Locker (158B)","90 Days/TBA",null,null,null,"Steps to Shops at Don Mills","Elegant Low-rise with 5 Star Hotel Ambiance","Open Concept Living & Dining Room","Bright and Sunny Suite","Steps to Restaurants, TTC and Hwy 401"]
["km000259","ARCHIVE","Family Residential",54,"Doonaree Drive",789900,null,"Muskoka-like Setting in the Heart of Don Mills!","Rare Ranch Bungalow with over 2000 Square Feet!","LAWRENCE/UNDERHILL"," 43°44'42.73\"N"," 79°19'45.22\"W",43.745202777777777,-79.329227777777774,null,null,null,null,"90.37 x 132 Feet","$4,622.61/2010","3+2","Double Car Garage + 8 Car Parking","1x4, 1x3",null,null,"60/90 Days/TBA","Cassandra PS or Broadlands PS (french immersion)","Milne Valley MS or Broadlands PS (french immersion)","Victoria Park CI or York Mills CI (french immersion)","4 Fireplaces","Ravine Setting","Walk-out Lower Level","In-Law Suite Potential/Home Office","2 Tier Deck with wood-burning fireplace","200 Amp","Hardwood flooring throughout main floor ‘08","Freshly Painted","Wired for Home Theatre with 10 Speaker Connections","Cul-de-Sac"]
["km000260","SOLD","Family Residential",65,"Olsen Drive",699900,null,"Super Sized Bungalow Reno'd from Top to Bottom!","Move in and Simply Enjoy Life!","YORK MILLS/DON MILLS"," 43°45'38.33\"N"," 79°20'35.43\"W",43.760647222222225,-79.343175000000002,null,null,null,null,"57.17 x 109.26 Feet","$3,942.68/2009","3+1","Double Car Garage + 3 Car Parking","1 x 4, 2 x 3 Piece",null,null,"June 2010/TBA","Rene Gordon ES or Broadlands PS (french immersion)","Donview MS or Windfields JH (french immersion)","George S Henry Academy or York Mills CI (french immersion)","New Roof 2010","New Furnace 2010","New Central Air Conditioning 2010","New Hardwood Flooring Throughout Main Floor (except in Kitchen)","Updated Windows Throughout","100 Amp Service"]
["km000261","SOLD","Family Residential",36,"Avonwick Gate",799900,null,"Gorgeous 2 Story Home in Demand Area!","Master Bedroom has 600 sf Sun Room!","LAWRENCE/UNDERHILL"," 43°45'5.11\"N"," 79°19'15.14\"W",43.751419444444444,-79.320872222222221,null,null,null,null,"50 x 120 Feet","$4,156.37/2009",5,"Double Car Garage + 2 Car Parking","1 x 5, 1 x 4, 1 x 3, 1 x 2 + Sauna",null,null,"60 Days or TBA","Ranchdale PS or Broadlands PS (french immersion)","Milne Valley MS of Windfields JH (french immersion)","Victoria Park CI or York Mills CI (french immersion)","600 sq ft addition of Master Bedroom with Sunroom","Hardwood flooring","European tilt and turn windows","Updated Kitchen with New Stainless Steel Appliances","Updated Bathrooms","Sauna","Central Heating and Air Conditioning (Forced Air Gas) with Electronic Humidifier and Air Filter","200 AMP Circuit Breakers","Interlocking brick driveway, entrance and patios","Roof  (2007)"]
["km000262","ARCHIVE","Family Residential",100,"Celeste Drive ",325500,null,"Attention Builders/Renovators!","Great Potential!","LAWRENCE/GALLOWAY"," 43°45'42.03\"N"," 79°12'1.46\"W",{"$f":"IF(ISBLANK(K204),\"\",DMS_to_Dec(K204))","v":43.761674999999997},-79.200405555555562,null,null,null,null,"49.6 x 116 Feet","$2,374.15/2009",3,"Detached Garage","1x4,1x2",null,null,"30 Days/TBA","Galloway Road Public School","Galloway Road Public School","Sir Wilfred Laurier Collegiate Institute, Sir Robert L Borden BTI"]
["km000263","ARCHIVE","Family Residential",6,"Timgren Drive",389900,null,"Charming Home Steps to All Amenities!","Renovated and Move-in Ready!","WARDEN/ELLESMERE"," 43°45'19.21\"N"," 79°17'50.61\"W",43.755336111111113,-79.29739166666667,null,null,null,null,"50 x 103 Feet","$2,378.43/2009",3,"Three Car Parking","1x4",null,null,"90 Days/TBA","Manhattan Park Junior Public School","Buchanan Public School","Wexford Collegiate Institute, Bendale BTI","Newer Roof","Quiet Street","Steps to TTC","Newer Windows","Private Backyard","Finished Basement","100 Amp Electrical Service","Refinished Hardwood Through-out"]
["km000264","SOLD","Family Residential",210,"Lord Seaton Road",1298000,null,"Rage Large Lot in High Demand Area","Builder Delight with  a Lot that has Over 35% Coverage","BAYVIEW/YORK MILLS"," 43°45'27.85\"N"," 79°23'38.26\"W",43.757736111111114,-79.393961111111125,null,null,null,null,"108 x 138 Feet Irregular","$6,701.48/2009",3,"Double Car Garage + 4 Car Parking","2x4, 1x2",null,null,"60 Days/TBA","Owen Public School","St.Andrew's Junior High School","York Mills Collegiate Institute"]
["km000265","ARCHIVE","Condo",500,"Queens Quay west",479900,null,"5 Star Luxury Condo Building Steps to The Lake!","Cozy up to the Fireplace! Hardwood Flooring Throughout & a Private Balcony!","QUEENS QUAY W/SPADINA"," 43°38'15.39\"N"," 79°23'41.26\"W",{"$f":"IF(ISBLANK(K207),\"\",DMS_to_Dec(K207))","v":43.637608333333333},-79.394794444444457,null,null,null,null,null,"$2,963.95/2009","1+1","1 Spot (178w)","1 x 4, 1 x 2 Piece","$485.56/mo (includes water, building insurance, parking & common elements) ","1 (#13)","June 2010 or TBA",null,null,null,"Hydro & A/C approx. $75/mo","AMENITIES: ","24 hour Concierge ","Newly equipped Exercise Room ","Newly renovated Party Room (Jan. 2010)","Large Board Room ","Sauna and steam room ","Indoor and outdoor hot tubs ","Visitor parking ","BBQ and outdoor Dining Area ","Library ","New carpet and wallpaper in hallways(Feb.2010)"]
["km000266","ARCHIVE","Family Residential",79,"North Hills Terrace",549900,null,"Beautiful Front, Side and Backyard! ","Cozy Family Home in Great Neighbourhood for Raising Kids!","DON MILLS/LAWRENCE"," 43°43'51.73\"N"," 79°20'26.66\"W",43.731036111111116,-79.340738888888879,null,null,null,null,"105 x 70 Feet","$3,852.92/2009",3,"2 Car Parking","1x4, 1x3",null,null,"Immediate/TBA","Greenland Public School, Norman Ingram Public School","Don Mills Middle School","Don Mills Collegiate Institute, Northern Secondary School","Beautiful Family Room Addition with Wood-Burning Fireplace","Walk-out to Solarium From Kitchen & Family Room","Large Private Yard","Gardeners Paradise"]
["km000267","ARCHIVE","Family Residential",4,"Plateau Crescent",998800,null,"Large Family Home on Ravine Lot!","Spacious with Unspoiled Lower Level Ready for You & Your Family!","DON MILLS/LAWRENCE"," 43°44'3.91\"N"," 79°20'10.95\"W",43.734419444444448,-79.33637499999999,null,null,null,null,"85 x 155, Rear:62 & West 128 Feet","$7,276.32/2009",4,"Circular Drive with Double Car Garage + 8 Car Parking","1x6,1x4,1x2 + Rough-in on Lower Level",null,null,"30 Days/TBA","Greenland Public School, Norman Ingram Public School","Don Mills Middle School","Don Mills Collegiate Institute, Northern Secondary School","Ravine Lot","10’ ceilings on all 3 floors","Roof ‘09","Central Vacuum","200 Amp Service","Central Air Conditioning","1 Gas Fireplace & 1 Wood Burning Fireplace","Updated United Windows Throughout"]
["km000268","ARCHIVE","Family Residential",160,"Marchington Circle",339900,null,"Attention First Time Buyers! Great Starter Home!","Lovely Family Neighbourhood! Close TTC, DVP, Highway 401 & Shopping!","WARDEN/ELLESMERE"," 43°45'24.05\"N"," 79°18'32.02\"W",{"$f":"IF(ISBLANK(K210),\"\",DMS_to_Dec(K210))","v":43.756680555555555},-79.308894444444448,null,null,null,null,"45 x 112 Feet","$2,632.72/2009","3+1","Detached Single Car Garage + 6 Car Parking","1 x 4, 1x3 Piece",null,null,"Immediate/TBA","Maryvale Public School","Maryvale Public School","Wexford Collegiate Institute, Bendale BTI","Roof 2007","Quiet Neighbourhood","Separate Entrance to Basement","Walking Distance To Shopping And Ttc.","Easy Access To Dvp And 401"]
["km000269","ARCHIVE","Family Residential",89,"Cassandra Boulevard",579900,null,"Large 2 Storey Updated Family Home!","Move-in and Enjoy!","LAWRENCE/UNDERHILL"," 43°44'58.00\"N"," 79°19'53.74\"W",43.749444444444443,-79.331594444444434,null,null,null,null,"55 x 131 Feet","$3,795.71/10","4+2","Single Car Garage + 2 Car Parking","1x4, 1x3, 1x2 Piece",null,null,"Immediate/TBA","Cassandra Public School","Milne Valley Middle School","Victoria Park Collegiate Institute","New Kitchen ‘09","Hardwood Flooring Throughout Main Floor ‘10","100 Amp Service","High Efficiency Furnace with Hepa Filter ‘09","Central Air Conditioning","Fascia, Soffits & Eavestrouphs ‘08"]
["km000270","ARCHIVE","Family Residential",4,"Teal Court",599900,null,"Located on Quiet Court! Super Family Home!","Lots of Natural Light Throughout Home! You Will Love this House!","DON MILLS/YORK MILLS"," 43°45'2.05\"N"," 79°20'9.46\"W",43.750569444444444,-79.335961111111104,null,null,null,null,"65 x 105 Feet","$4,335.48/2009","3+1","Single Car Garage + 4 Car Parking","1x4, 1x3",null,null,"July 28,29 2010/TBA","Three Valleys Public School","Milne Valley Middle School","George S Henry Academy","Two Wood Burning Fireplaces","200 Amp Service","Furnace ‘08","Large Private Lot","Mostly New Windows ‘05","New Kitchen ‘03"]
["km000271","ARCHIVE","Family Residential",11,"Deerpath Road",699900,null,"Beautifully Renovated Throughout! ","Enjoy the Backyard Oasis with Inground Gunite Pool!","LAWRENCE/UNDERHILL"," 43°45'4.75\"N"," 79°19'10.82\"W",{"$f":"IF(ISBLANK(K213),\"\",DMS_to_Dec(K213))","v":43.751319444444448},-79.319672222222223,null,null,null,null,"60 x 100 Feet","$4,462.35/2009","3+1","Double Car Garage + 2 Car Parking ","1 x 5, 1 x 4, 1 x 3, 1 x 2 Piece",null,null,"July 21/2010 or TBA ","Ranchdale Public School","Milne Valley Middle School","Victoria Park Collegiate Institute","Central Air Conditioning","In-Ground Gunite Swimming Pool","200 Amp Service","Quiet Family Neighbourhood"]
["km000272","SOLD","Family Residential",3,"Brynhurst Court",1990000,null,"High Demand Area! This House Has All the Bells & Whistles!","This is a WOW! Luxury Living in this Tastefully & Professionaly Decorated Home!","YONGE/BLYTHWOOD"," 43°42'56.53\"N"," 79°23'53.03\"W",43.715702777777778,-79.398063888888899,"http://tours.advirtours.com/118115P",null,null,null,"41.11 x 95.11 Feet Per Survey","$5,323.95/2010","4+1","Single Car Garage + 2 Car Parking","1x7, 1x5, 1x4, 1x3, 1x2",null,null,"90 Days/TBA","Blythwood Junior Public School","Glenview Senior Public School","North Toronto Collegiate Institute  ","Central Vacuum","Central Air Conditioning","Maintenance Free Humidifier","Alarm System","Heated Interlocking Brick Driveway & Front Porch","Heated Flooring in Lower Level","Sprinkler System","Cedar Roof","Landscaping"]
["km000273","ARCHIVE","Family Residential",71,"Dingwall Avenue",409900,null,"Renovator's Delight Steps to the Danforth!","Detached and Spacious 3 Storey Home in Demand Area!","DANFORTH/EAST OF PAPE"," 43°40'26.26\"N"," 79°20'28.86\"W",43.673961111111112,-79.341349999999991,null,null,null,null,"20 x 102","$3,726.84/2009",3,null,"1x4",null,null,"30 Days/TBA","Blake Street Junior Public School","Earl Grey Senior Public School","Riverdale Collegiate Institute, Danforth C & TI"]
["km000274","ARCHIVE","Family Residential",83,"Cavehill Crescent",498800,null,"Super Spacious Backsplit with Villa-like Setting!","Private Front and Back Gardens!","PHARMACY/HWY 401"," 43°45'58.32\"N"," 79°18'32.00\"W",{"$f":"IF(ISBLANK(K216),\"\",DMS_to_Dec(K216))","v":43.766199999999998},-79.308888888888887,null,null,null,null,"55 x 95 Feet","$2,632.00/2009",3,"Carport + 4 Car Parking","1 x 4, 1 x 2 Piece",null,null,"60-90 Days or TBA","Terraview-Willowfield PS ","Terraview-Willowfield PS","Victoria Park CI","Beautifully landscaped"," Flat Roof ‘08","Over $150,000 Spent in Upgrades"]
["km000275","ARCHIVE","Family Residential",24,"Lacewood Crescent",699900,null,"Lovely Bungalow on Ravine-like lot!","Skylight in Updated Kitchen Brings in Lots of Natural Light!","DON MILLS/YORK MILLS"," 43°44'57.95\"N"," 79°20'11.14\"W",43.749430555555556,-79.336427777777772,null,null,null,null,"46 x 186 feet Rear:131 feet North 114 feet","$5,002.60/2009","3+1","Double Car Garage + 4 Car Parking","1x4, 1x3, 1x2 Piece",null,null,"60-90 Days Or TBA","Three Valleys PS   ","Milne Valley MS","George S Henry Acedemy","Roof '06","Furnace '09","Central Air Conditioning","200 Amp Service","Water Softener"]
["km000276","SOLD","Family Residential",40,"Clovercrest Road",848800,null,"Just stunning! This is a beautifully renovated home!","Located on a prestigious, tranquil street in an upscale family neighbourhood!","SHEPPARD/LESLIE"," 43°46'27.85\"N"," 79°21'45.79\"W",43.77440277777778,-79.362719444444437,null,null,null,null,"50 x 120 Feet","$4,476.91/2009","4+1","Double Car Garage + 2 Car Parking","1x6, 1x5, 1x3, 1x2 Piece",null,null,"30 Days or TBA","Dallington P.S","Woodbine JHS","Georges Vanier S.S.","Roof '05","Furnace '09","Central Air Conditioning ’09","Water Softner ’09","Hardwood Flooring Throughout Main Floor","Renovated Kitchen"]
["km000277","ARCHIVE","Family Residential",108,"Billington Crescent",379900,null,"Super Spacious Semi in Family Friendly Neighbourhood!","Great Starter Home with Large Backyard!","YORK MILLS/DVP"," 43°45'58.25\"N"," 79°20'3.05\"W",{"$f":"IF(ISBLANK(K219),\"\",DMS_to_Dec(K219))","v":43.766180555555557},-79.334180555555548,null,null,null,null,"23 x 107 Feet","$2,662.64/2009",4,"5 Car Parking","1x4, 1x2 Piece",null,null,"30 Days/TBA","Fenside Public School","Donview Middle School","George S. Henry Academy","In Your Neighbourhood","DVP, Highway 404 & Highway 401","TTC (Fenside and/or York Mills Bus to Yonge Subway Line)","Fenside Arena, Baseball Park & Tennis Courts","Parkway Mall","Parkwoods Plaza","Fairview Mall with Sheppard Subway Line","Shops at Don Mills"]
["km000278","ARCHIVE","Condo",7,"Concorde Place #508",354800,null,"Commuter’s Paradise with Fabulous Amenities","Spacious Suite – Approx 1400 sq ft Corner Unit","DVP/WYNFORD"," 43°43'50.50\"N"," 79°19'38.69\"W",43.730694444444445,-79.327413888888884,null,null,null,null,null,"$2,102.76/2009","2 + 1","1 Car Parking Underground ( close to door)","2 x 4 Piece","529.36/mo (includes heat, central air, common elements & Building insurance)","1 Locker (close to door)","July 30 2010 or TBA","Gateway PS","Valley Park MS/Don Mills CI","Marc Garneau CI/Don Mills CI","Upgraded and Modern","Split Bedrooms","Professionally Painted by Designer","New Stainless Steel Kitchen Appliances","Engineered Hardwood","Custom Built Closets with Custom Shelves","Updated Bathrooms","Large Updated Kitchen"]
["km000279","ARCHIVE","Family Residential",5,"Underhill Drive",499900,null,"Gracious & Spacious Detached Home in Super Area!","Steps to TTC, Shopping, Parks & Schools!","LAWRENCE/UNDERHILL"," 43°44'29.12\"N"," 79°19'29.19\"W",43.741422222222226,-79.324775000000002,null,null,null,null,"57 x 120 Feet","$3,457.59/2009","3+1","Single Car Garage + 5 Car Parking","1x4, 1x3",null,null,"Roof 2007","Cassandra Public School or Ranchdale Public School","Milne Valleys Middle School","Victoria Park Collegiate Institute","Roof 2007","Furnace 2000","100 Amps Service","Central Air Conditioning 2000"]
["km000280","ARCHIVE","Condo",35,"Mariner Terrace #1511",null,1750,"Gorgeous Unobstructed Southern Views","30,000 sq ft Super Club with Full Amenities","SPADINA/LAKESHORE"," 43°38'23.12\"N"," 79°23'31.72\"W",43.639755555555553,-79.392144444444455,null,null,null,null,null,null,null,"1 Parking Spot","1 x 4 Piece","includes water, heat, hydro, central air & parking",null,"July 2010 or TBA",null,null,null,"Engineered flooring","Balcony & Bedroom Overlook Toronto Harbour","Built-in Stove, Microwave and dishwasher"]
["km000281","ARCHIVE","Family Residential",215,"Gamble Avenue",359900,null,"Attention Renovator's & Builder's!","Super Opportunity Steps to the Danforth!","PAPE/O'CONNOR"," 43°41'28.44\"N"," 79°20'40.70\"W",{"$f":"IF(ISBLANK(K223),\"\",DMS_to_Dec(K223))","v":43.691233333333329},-79.344638888888881,null,null,null,null,"20 x 150 Feet","$2,681.87/2010","2+1","1 Parking Pad","1x4",null,null,"30 Days/TBA","William Burgess Elementary School","Westwood Middle School","East York Collegiate Institute"]
["km000282","ARCHIVE","Family Residential",39,"Silver Spruce Drive",549900,null,"Super Spacious Sidesplit Updated and Backing On to Green Space","On A Demand Street in a Wonderful Family Neighbourhood!","WARDEN/FINCH"," 43°48'6.80\"N"," 79°19'28.96\"W",43.80188888888889,-79.324711111111114,"http://www.karenmillar.com/spotlight_slideshow.php?id=km000282",null,null,null," 50 x 110 Feet"," $3,173.67/2011",2," Double Car Garage + 2 Car Parking"," 1 x 4, 1 x 2 Piece",null,null," 60 Days or TBA","Beverly Glen Jr PS","Sir Ernest MacMillan Sr PS","L'Amoreaux CI  ","Backs onto Green Space","Central Air Conditioning & Furnace 2011","Newer Windows","Roof 2002","Main Floor Family Room","Main Floor Laundry","3 Walk-outs to Backyard","200 Amp Circuit Breakers"]
["km000283","ARCHIVE","Family Residential",32,"Avonwick Gate",589900,null,"Great Family Home in Sought After Neighbourhood!","Schools, Parks And Ravines Are Only Steps Away!","LAWRENCE/UNDERHILL"," 43°45'3.90\"N"," 79°19'15.40\"W",43.751083333333334,-79.320944444444436,null,null,null,null,"49.3 x 121.14 Feet","$3,979.00/2009",4,"Double Car Garage + 2 Car Parking","1 x 5, 1 x 3 Piece",null,null,"30 Days or TBA","Ranchdale PS or Broadlands PS (french immersion)","Milne Valley MS of Windfields JH (french immersion)","Victoria Park CI or York Mills CI (french immersion)","Private Back Garden"," 2 Carrier Air Conditioning Units","Family Room with Walk-out to Backyard","Wood-Burning Fireplace"]
["km000284","ARCHIVE","Family Residential",131,"Chestnut Crescent",271500,null,"Steps to Ttc, Schools and Parks","Great Potential!","ST.CLAIR/BIRCHMOUNT"," 43°43'4.12\"N"," 79°16'29.18\"W",{"$f":"IF(ISBLANK(K226),\"\",DMS_to_Dec(K226))","v":43.717811111111111},-79.274772222222225,null,null,null,null,"30 x 100 Feet","$1,955.31/2009",3,"2 Car Parking","1 x 4, 1 x 2 Piece",null,null,"30 Days or TBA"]
["km000285","ARCHIVE","Family Residential",83,"Combermere Drive",349900,null,"Rare contemporary model backing onto greenspace","Super opportunity for investor or first time buyer","W VICTORIA PARK/ELLESMERE"," 43°45'26.30\"N"," 79°19'11.93\"W",43.757305555555554,-79.319980555555546,null,null,null,null,"26.27 x 112.37 Feet","$2,907/2010",3,"Single Car Garage + 2 Car Parking","1 x 4, 1 x 2 Piece",null,null,"Immediate"]
["km000286","ARCHIVE","Family Residential",7,"Farmcote Road",649900,null,"Amazing Donalda Golf Club Neighbourhood!","Charming Bungalow with Cathederal Ceilings & Bright Sun Flooded Rooms !","DON MILLS/LAWRENCE"," 43°44'44.19\"N"," 79°20'38.73\"W",43.745608333333337,-79.344091666666657,null,null,null,null,"60 x 100 Feet","$3,895.37/2010",3,"Carport + 4 Car Parking","1 x 4, 1 x 2 Piece",null,null,"60 Days or TBA","Greenland Public School, Norman Ingram Public School  ","Don Mills MS ","Don Mills CI  or Northern SS","Steps to The Shops at Don Mills","TTC, Schools, Parks & Edwards Garden"]
["km000287","ARCHIVE","Family Residential",92,"Castlegrove Boulevard",579900,null,"Rare Park-Like Lot with Great Back & Side Yards","Great Neighbourhood with Walking Distance to French Immersion School","LAWRENCE/UNDERHILL"," 43°44'56.05\"N"," 79°19'1.92\"W",{"$f":"IF(ISBLANK(K229),\"\",DMS_to_Dec(K229))","v":43.748902777777779},-79.3172,null,null,null,null,"120 ft front, 119 ft and 38.87 ft side, and 148 ft rear","$3961.91/2009",3,"Oversized Double Car Garage + 4 Car Parking","1 x 4, 1 x 3, 1 x 2 Piece",null,null,"60 Days or TBA","Cassandra PS or Ranchdale PS","Milne Valley MS","Victoria Park CI","Re-finished Hardwood Flooring ","Roof 2010","New Chimney","2 Staircases to Lower Level","Updated Kitchen","New Windows in Main & Upper Level","Aluminium Soffits & Fascia"]
["km000288","ARCHIVE","Family Residential",93,"Pale Moon Crescent",339900,null,"First Time Buyers or Investors!","Great Opportunity to Purchase In A Wonderful Family Neighbourhood","WARDEN/STEELES"," 43°48'40.09\"N"," 79°19'14.52\"W",43.811136111111111,-79.320700000000002,null,null,null,null,"20x111.06","$2,639.14/2009",3,"Single Car Garage + 1 Car Parking","1 x 4, 1 x 2 Piece",null,null,"Immediate or TBA","David Lewis PS ","David Lewis PS ","Dr Norman Bethune CI or Bendale BTI","Parks, Schools, Transportation are just around the corner","Tenant to be assumed ($1200/mo)"]
["km000289","ARCHIVE","Family Residential",105,"Broadlands Boulevard",525500,null,"Beautiful & Updated Throughout!","Wonderful Garden with an Extra Large Deck!","LAWRENCE/UNDERHILL"," 43°44'42.99\"N"," 79°18'58.37\"W",43.745274999999999,-79.316213888888882,null,null,null,null,"50 x 120 Feet","$3,387.05/2010","3+1","Single Car Garage + 3 Car Parking","2 x 4 Piece",null,null,"60 Days or TBA","Cassandra PS/Ranchdale PS","Milne Valley MS","Victoria Park CI","Roof ‘08","Hot Water Gas","100 amp Service","Freshly Painted ‘10","Interior Doors ‘09","Updated windows","Kitchen Updated ‘09","Bathrooms Updated ‘09","Sound Proofing Between Upper & Lower Level"]
["km000290","ARCHIVE","Family Residential",23,"Ravenrock Court",299900,null,"Great Potential! First Time Home Buyer or Investor!","Great Family Neighbourhood!","York Mills/W. of Victoria Park"," 43°45'42.23\"N"," 79°19'11.12\"W",{"$f":"IF(ISBLANK(K232),\"\",DMS_to_Dec(K232))","v":43.761730555555559},-79.319755555555545,null,null,null,null,"37.28 x 125 Feet","$2,960.99/2010",3,"Single Car Garage + 2 Car Parking","1 x 4, 1 x 2 Piece",null,null,"Jan. 2011/TBA","Roywood PS","Donview MS ","Victoria Park CI","Hardwood flooring","New Roof 2010","Quiet Cul-de-Sac","Close to Shops, ttc and restaurants"]
["km000291","ARCHIVE","Family Residential",63,"Dingwall Avenue",649900,null,"Prime Riverdale Location! Renovated From Top To Bottom!","Lower Level Has Basement Apartment With Separate Entrance (not retrofit)","PAPE/DANFORTH"," 43°40'26.04\"N"," 79°20'28.26\"W",43.673899999999996,-79.341183333333333,null,null,null,null,"20 x 102 Feet","$3,546.53/2010","3 + 2","Widened Driveway Parking Pad + Detached Single Car Garage","3 x 4 Piece",null,null,"September 1st/2010 or TBA","Blake Street Jr PS  ","Earl Grey Sr PS ","Riverdale CI  ","Walk to Withrow Park","Separate Entrance to Lower Level","The Danforth Shops & Restaurants","Located on a Quiet, Tree Lined Street","Updated Windows","Roof 2002","The Danforth Subway"]
["km000292","SOLD","Family Residential",27,"Southwell Drive",799900,null,"Rare Extra-Spacious Sideslpit in Sought-After Neighbourhood","Family Room Addition Overlooks Garden with Pool and Southwell Park","LESLIE/LAWRENCE"," 43°44'49.41\"N"," 79°21'23.27\"W",43.747058333333335,-79.356463888888882,null,null,null,null,"60 x 110.4 feet","$4,333.43/2010","3+1","Single Car Garage + 2 Car Parking","2 x 4 Piece",null,null,"July/October 2010","Blake Street Jr PS  ","St. Andrews JHS  or Windfields JHS(fr. Immersion)","York Mills CI","Roof - New 2010","Furnace & Air conditioning - New 2009","Cathedral Ceiling in Family Room","2 Fireplaces - 1 Gas - 1 - Wood-Burning"]
["km000293","ARCHIVE","Family Residential",38,"Granby Street",599900,null,"Funky 4 Storey Townhouse in Downtown Toronto!","Super Potential! Receive Access to All Condo Amenites!","Carlton/Church"," 43°39'39.46\"N"," 79°22'50.67\"W",43.660961111111106,-79.380741666666665,null,null,null,null,null,"$4,333.74/09",3,"Single Car Garage + 1 Car Parking","2x5, 1x2","$804.44/mo (includes heat, hot water, hydro, central air, building insurance, parking & common elements)",null,"30 Days/TBA","Church Street Junior Public School","Winchester Junior & Senior Public School","Jarvis Collegiate Institute, Northern Secondary School, Central Commerce Collegiate Institute"]
["km000294","SOLD","Family Residential",10,"Charnwood Road",749900,null,"Super Location with Amazing Lot!","Beautifully Renovated Bungalow","LESLIE/YORK MILLS"," 43°44'40.36\"N"," 79°21'24.29\"W",{"$f":"IF(ISBLANK(K236),\"\",DMS_to_Dec(K236))","v":43.744544444444443},-79.356747222222211,null,null,null,null,"47.38 x 130 Feet","$4,530.77/2010","3+2","Extra long single car garage + 3 car parking","1 x 4, 1 x 3 Piece",null,null,"120 Days or TBA","Rippleton Public School","St. Andrews JHS  or Windfields JHS(fr. Immersion)","York Mills CI","Roof 2002","High Efficiency Furnace 2003","In-Ground Sprinkler System","Central Air Conditioning 2007","Windows - New 2008","Kitchen - '06"]
["km000295","ARCHIVE","Family Residential",10,"Tangle Briar Way",289766,null,"Great for First Time Buyer!","Steps to all Amenities!","LESLIE/VAN HORNE"," 43°47'1.23\"N"," 79°22'2.68\"W",43.783674999999995,-79.36741111111111,null,null,null,null,null,"$2,198.92/2009",3,"Single Car Garage + 1 Car Parking","1x4, 1x2","$436.08/mo (includes water, cable, parking, common elements & building insurance)",null,"30 Days/TBA","Lescon Public School","Don Valley Junior High School","Georges S Vanier Secondary School"]
["km000296","ARCHIVE","Family Residential",56,"Dukinfield Crescent",549900,null,"Amazing Hardwood Flooring Throughout!","Large Backyard, Great Sun Room! A Must See!","YORK MILLS/FENSIDE"," 43°45'44.98\"N"," 79°19'57.24\"W",43.762494444444442,-79.332566666666665,null,null,null,null,"56.49 x 175.34 Feet","$4165.32/2010",4,"Double Car Garage + 4 Car Parking","2x4, 1x3, 1x2",null,null,"60 Days/TBA","Fenside Public School","Donview Middle School","George S Henry Academy","One of a Kind","Kitchen Oak Cabinets","Extra Wide Double Car Garage","Roof 2003"]
["km000297","ARCHIVE","Condo",1210,"Don Mills Road #124",299900,null,"Spacious Ground Floor Unit with Large Balcony!","Sought After Building with Fantastic Amenities!","DON MILLS/LAWRENCE"," 43°44'23.61\"N"," 79°20'45.79\"W",{"$f":"IF(ISBLANK(K239),\"\",DMS_to_Dec(K239))","v":43.739891666666665},{"$f":"IF(ISBLANK(L239),\"\",DMS_to_Dec(L239))","v":-79.346052777777771},null,null,null,null,null,"$2,063.97/2010",1,"1 Underground Parking Spot #22B","1x4","$524.14 (includes: heat, hydro, water, central air, parking, basic cable, building insurance and common elements.)","1 #163B","Immediate/TBA",null,null,null,"South Facing Balcony","Immaculate Building","Outdoor Pool","Sauna","Terraced Sun Deck","Party Room","Exercise Room","Video Room","Racquetball/Squash Courts","24 Hour Concierge"]
["km000298","ARCHIVE","Family Residential",136,"Three Valleys Drive",499900,null,"Beautifully Updated Semi Steps to Donalda Golf Course!","Prime Ravine Lot! ","DON MILLS/YORK MILLS"," 43°44'49.89\"N"," 79°20'11.79\"W",{"$f":"IF(ISBLANK(K240),\"\",DMS_to_Dec(K240))","v":43.747191666666666},{"$f":"IF(ISBLANK(L240),\"\",DMS_to_Dec(L240))","v":-79.336608333333331},null,null,null,null,"36 x 126.25 Feet","$3,650.36/2010",4,"Single Car Garage + 2 Car Parking","2x4. 1x2",null,null,"90 Days/TBA","Three Valleys Public School","Milne Valley Middle School","George S. Henry Academy","Prime Ravine Lot","Central Air Conditioning","Main Roof 2009","Furnace 2008 & Humidifier/Air Purifier 2008","All Updated Windows","Re-Insulated Attic 2008","100 Amp Service","Stainless Steel Appliances 2003"]
["km000299","ARCHIVE","Family Residential",47,"Bexhill Avenue",329900,null,"Attention First Time Buyers! This is the House for You!","Quite Neighbourhood! Great Backyard !","ST.CLAIR/PHARMACY"," 43°42'10.39\"N"," 79°17'20.16\"W",{"$f":"IF(ISBLANK(K241),\"\",DMS_to_Dec(K241))","v":43.702886111111113},-79.288933333333333,null,null,null,null,"35 X 104 Feet","$2,454.34/2010",2,"3 Car Parking","1x4, 2x2",null,null,"Immediate/TBA","Regent Heights Public School","Regent Heights Public School","SATEC@WA Porter Collegiate Institute","In Your Neighbourdood","Regent Park","Dentonia Golf Course","Taylor Creek Park","West Scarborough Neighbourhood Community Centre","Steps to Danforth Shops & Restaurants","TTC & Subway"]
["km000300","SOLD","Family Residential",124,"Brookbanks Drive",889900,null,"Gorgeous Private Ravine Setting!","Spacious and Updated! This is a Gem!","DON MILLS/YORK MILLS"," 43°45'15.58\"N"," 79°19'40.31\"W",43.754327777777775,-79.327863888888885,"http://tours.advirtours.com/117284P",null,null,null,"120 x 128.58 Feet","$6,341.41/2010","3+1","Double Carport + 3 Car Parking","1x7, 1x4, 1x3, 1x2",null,null,"30 Days/TBA","Ranchdale Public School","Milne Valley Middle School","Victoria Park Collegiate Institute","Secluded & Private Ravine Lot","200 Amp Service","Central Air Conditioning & Air Cleaner","Intercom System","Bank Restoration","Mostly Updated Windows","Updated Bathrooms","Updated Kitchen"]
["km000301","ARCHIVE","Family Residential",23,"Freeborn Crescent",199900,null,"Attention Renovator's & Builder's!","Spacious 2 Storey with Lots of Potential!","LAWRENCE/BRIMLEY"," 43°45'32.24\"N"," 79°15'37.16\"W",43.758955555555552,-79.260322222222229,null,null,null,null,"27.5 x 97.66 Feet","$2,055.66/2010",3,"2 Car Parking","1x4",null,null,"30 Days/TBA","Donwood Park Junior Public School","Edgewood Public School","D & M Thomson Collegiate Institute"]
["km000302","ARCHIVE","Condo",205,"The Donway West PH819",529900,2500,"Sought After Luxury Low Rise!","Southern Views in the Penthouse!","DON MILLS/LAWRENCE"," 43°44'14.08\"N"," 79°20'47.88\"W",{"$f":"IF(ISBLANK(K244),\"\",DMS_to_Dec(K244))","v":43.737244444444443},{"$f":"IF(ISBLANK(L244),\"\",DMS_to_Dec(L244))","v":-79.34663333333333},null,null,null,null,null,"$3,563.84/2009","2+1","2 Car Parking in Underground (#158 & #159)","2x4","$743.59/mo (includes water, heat, hydro, central air conditioning, parking, building insurance & common elements)",null,"Sept. 2010/TBA","Greenland Public School, Norman Ingram Public School  ","Don Mills MS ","Don Mills CI  or Northern SS","Steps to The Shops at Don Mills","TTC, Schools, Parks & Edwards Garden"]
["km000303","ARCHIVE","Family Residential",162,"Banbrooke Crescent",314000,null,"Spacious 2 Story Townhome!","Perfect for a First Time Buyer!","YONGE/MULOCK",null,null,null,null,null,null,null,null,"19.69 x 118.11 Feet","$2,977.67/2010",3,"Single Car Garage + 2 Car Parking","2x4, 1x2"]
["km000304","ARCHIVE","Family Residential",47,"Pale Moon Crescent",349900,null,"Great Opportunity for First Time Buyer!","Super Location with Parks, Schools and Transportation!","WARDEN/McNICOLL"," 43°48'37.15\"N"," 79°19'18.53\"W",{"$f":"IF(ISBLANK(K246),\"\",DMS_to_Dec(K246))","v":43.810319444444438},-79.321813888888883,null,null,null,null,"20 x 100 Feet","$2,591.38/2010",3,"Single Car Garage + 1 Car Parking","1 x 4, 1 x 2 Piece",null,null,"Immediate or TBA",null,null,null,"Freshly Painted Throughout","Fireplace in Recreation Room","Walk-out from Living Room to Backyard"]
["km000305","ARCHIVE","Condo",12,"Rean Drive PH 10",399900,null,"Penthouse Suite in Sought After Building!","Walk to Bayview Village, TTC or Subway!","BAYVIEW/SHEPPARD"," 43°45'58.17\"N"," 79°23'0.07\"W",43.766158333333337,-79.383352777777787,null,null,null,null,null,"$2,508.32/2010",1,"1 (Underground #109)","1x3","$469.49 (includes: water, heat, central air, parking, building insurance & common elements)","1 (#21-9)","60 Days/TBA",null,null,null,"Penthouse","High Ceiling Throughout","Ensuite Laundry","Large Balcony","5-Star Amenities & Services at Amica for Residents to Enjoy","Across from Bayview Village","Steps to TTC, Subway, Highway 401 & DVP","Hair Salon, Hot Tub"]
["km000306","ARCHIVE","Condo",18,"Concorde Place #4",399900,null,"This is a Fantastic Unit that Overlooks the Courtyard!","Builder's Model with Many Upgrades!","DON MILLS/WYNFORD"," 43°43'49.08\"N"," 79°19'41.95\"W",43.7303,-79.328319444444446,null,null,null,null,null,"$2,811.49/2010",2,"1 Underground Spot (C3)","1x4, 1x3","$910.32 (includes water, heat, hydro, cable, Central Air, Parking, Building Insurance & Common Elements)","1 (#A82)","Sept.27/10",null,null,null,"1400 Square Feet!","Two Walk-outs to a Balcony!","Gas Fireplace","Amazing Amenities Include:","Indoor Pool","Residents Lounge","Billiards Room","Library","Exercise Room","Tennis Court","Twenty-Four Hour Concierge","Security Guard/Security System","Newly Renovated Guest Suite","Gas BBQ’s Permitted on Balconies"]
["km000307","SOLD","Family Residential",404,"Leslie Street",750000,null,"Totally Renovated! Brand New Inside & Out!","Top of the Line Appliances and Finishes in this Spacious 2-Storey Semi!","GREENWOOD/GERRARD"," 43°40'16.53\"N"," 79°20'1.84\"W",{"$f":"IF(ISBLANK(K249),\"\",DMS_to_Dec(K249))","v":43.671258333333334},-79.333844444444438,null,null,null,null,"18.25 x 137 Feet","$2,671.87/2010",3,"2 Car Parking","2x4, 1x3, 1s2",null,null,"30 Days/TBA","Blake Street Junior Public School","Duke of Connaught Senior Public School","Riverdale Collegiate Institute, Danforth C & TI",null,"Everything New - Interior & Exterior & Built to 2010 Code or better!","All Permits Available","Top of the Line Mirage Exotic Hardwood Flooring","All Solid Pine Shaker Doors in Interior","All Top of the Line Door Hardware","All Exterior Doors are New & Fiberglass","All New Copper Plumbing","All New Sewer and Water Supply Piping","All New Insulation Throughout","All New Windows Throughout","All New 50 Year Architectural Shingle Roof","High Efficiency Central Air Conditioner","97% High Efficiency Gas Furnace","New Gas Hot Water Heater  - owned","New Central Vacuum","200 Amp Service","Three Panel Hardwired Security System with Infrared Cameras, Wireless Remotes & 10 Day DVR Backup","8” Solid Wood Baseboards Throughout","Solid Wood Trim Throughout","Top of the line Stainless Steel Kitchen Appliances","KraftMaid Kitchen "]
["km000308","SOLD","Family Residential",6,"Lacewood Crescent",549900,null,"Updated and Move in Ready!","Fantastic Family Neighbourhood!","DON MILLS/YORK MILLS"," 43°44'59.04\"N"," 79°20'13.23\"W",43.749733333333332,-79.33700833333333,null,null,null,null,"60 x 100 Feet","$4,456.01/2010",3,"Single Car Garage + 3 Car Parking","1x4",null,null,"30 Days/TBA","Three Valleys Public School","Milne Valley Middle School","George S. Henry Academy","All Updated Windows","200 Amp Service","Central Air Conditioner","Furnace ‘01","New Lawn in Front & Back Yards"]
["km000309","ARCHIVE","Condo",18,"Mondeo Drive, #925",199900,null,"Great Investment Opportunity!","Luxury Tridel Building!","BIRCHMOUNT/ELLESMERE"," 43°45'53.46\"N"," 79°17'16.69\"W",43.764850000000003,-79.287969444444443,null,null,null,null,null,"$1287.38/2010",1,"1 Underground Parking Spot","1x4","$329.61 (includes, heat, hydro,water, central air, parking, common elements, building insurance)","1, #A217","30 Days/TBA"]
["km000310","SOLD","Family Residential",28,"Crossburn Drive",849900,null,"RAVINE! Spacious & Renovated!","Demand Neighbourhood with School, Shops at Don Mills, TTC, Hwy 401 & DVP","DON MILLS/LAWRENCE"," 43°44'36.51\"N"," 79°20'35.52\"W",43.743475000000004,-79.343199999999996,null,null,null,null,"48.86 x 155.25 Feet","$4,663.66/2010","3 + 1","Single Car Garage + 2 Car Parking","1 x 4, 2 x 3, 1 x 2 Piece",null,null,"October 2010 or Tba","Greenland PS */ Norman Ingram PS ","Don Mills CI","Don Mills CI","Ravine Property","Pella Windows Thoughout Main & Second Floor '09","Furnace 2001","Roof Approx. 6 Years","2 Central Vacuum Systems","2 Central Air Conditioners","2 Electric Air Filters","100 Amp Service","New Hardwood Flooring Thoughout Main Level '09"]
["km000311","SOLD","Family Residential",15,"Hurlingham Crescent",749900,null,"In The Denlow School District","Beautifully Renovated Bungalow on Private Super Size Lot","YORK MILLS/LESLIE"," 43°45'3.09\"N"," 79°21'26.79\"W",{"$f":"IF(ISBLANK(K253),\"\",DMS_to_Dec(K253))","v":43.750858333333333},-79.357441666666659,null,null,null,null,"60x135 Feet","$4,410.33/2010","2+1","Single Car Garage + 5 Car Parking","1 x 4, 1 x 3 Piece",null,null,"60 Days or Tba","Denlow PS","Winfields JH","York Mills CI","All Updated Windows","Renovated Thoughout","100 Amp Service","Central Vacuum","Central Air Conditioning","Cathedral Ceilings Throuhout"]
["km000312","ARCHIVE","Family Residential",28,"Chestergrove Crescent",579900,null,"Spacious & Well Maintained Family Home","Fabulous Lot in Sought After Neighbourhood","PHARMACY/COLLINGSBROOK"," 43°47'17.07\"N"," 79°19'18.82\"W",43.788074999999999,-79.321894444444439,null,null,null,null,"40.55 x 152.28 Feet","$3,762.48/2010",4,"Double Car Garage + 4 Car Parking","2 x 4, 1 x 2 Piece",null,null,"Immediate or TBA","North Bridlewood Jr PS","JB Tyrrell Sr PS","Sir John A Macdonald CI","Roof 2009","Large Pie Lot","Forced Air Gas Furnace","200 Amp Service","Mostly Updated Windows","Central Air Conditioning","Hardwood Flooring Throughout","Aluminum Soffits & Fascia"]
["km000313","SOLD","Family Residential",47,"Forest Heights Boulevard",2488800,null,"Grand 2 Storey Home with Back Garden Spa!","Cathedral & 9 Foot Ceilings! Skylights! Fireplaces! Great Home for Entertaining!","BAYVIEW/FOREST HEIGHTS"," 43°45'32.36\"N"," 79°22'56.60\"W",43.758988888888886,-79.382388888888883,"http://tours.advirtours.com/118141P",null,null,null,"121 x 132.70 Feet","$14,979.33/2010","5+2","Triple Car Garage + 10 Parking Spaces","1x6, 2x5, 2x4, 2x2",null,null,"Immediate/TBA","Harrison Public School","Windfields Junior High School","York Mills Collegiate Institute","Main Floor Family Room","Main Floor Laundry Room","Four Fireplaces","Inground Pool & Hot Tub","200 Amp Service","Central Vacuum","Central Air Conditioning","Alarm System","Large Premium 121 Foot Lot","Roof Approximately 2-3 Years Old","Underground Sprinkler System in Front & Back Yards"]
["km000314","SOLD","Family Residential",52,"Camwood Crescent",549900,null,"Cozy and Updated! This is a Great Family Home!","Private and Large Backyard!","YORK MILLS/DON MILLS"," 43°45'39.42\"N"," 79°20'18.62\"W",{"$f":"IF(ISBLANK(K256),\"\",DMS_to_Dec(K256))","v":43.760950000000001},-79.338505555555557,null,null,null,null,"52.31 x 122.87 Feet","$3,911.99/2010","3+2","Single Car Garage + 2 Car Parking","1x4, 1x3, 1x2",null,null,"60 Days/TBA","Rene Gordon Elementary School","Donview Middle School","George S Henry Academy","All Main Floor Windows’09","Completely New Roof ’09","Central Air Conditioner’02","Furnace, Air Filter & Cleaner’02","200 Amp Service New’02","All New Appliances’03"]
["km000315","SOLD","Family Residential",25,"Medhurst Road",449900,null,"Great Updated Home Backing on to Greenbelt!","Spacious Bungalow! Private and Gorgeous Prennial Back Garden","VICTORIA PARK/ST.CLAIR"," 43°42'0.72\"N"," 79°17'38.67\"W",43.700200000000002,-79.294074999999992,null,null,null,null,"40 x 127.58 Feet","$2,392.04/2010","3+1","Single Car Garage + 4 Car Parking","1x4, 1x3",null,null,"Nov. 2010/TBA","George Webster Elementary School ","Gordon A Brown Middle School\n","East York Collegiate Institute, Danforth C&TI","Roof '06","Furnace '99","Central Air Conditioner ’02","Central Vacuum","All New Main Floor Windows '06","200 Amp Service","New Kitchen '09","Stainless Steel Kitchen Aid Appliances '09","Updated Bathrooms '05"]
["km000316","SOLD","Family Residential",35,"Woodfield Road",599900,null,"Great 2 Storey Detached Home Steps to Queen Street!","Updated and Spacious! Private Backyard and 2 Car Parking!","QUEEN/LESLIE"," 43°39'52.48\"N"," 79°19'15.07\"W",43.664577777777779,-79.320852777777773,null,null,null,null,"20 x 120 Feet","$3,110.49/2010",3,"2 Car Parking","1x4, 1x3",null,null,"Dec.2010/TBA","Duke of Connaught Junior and Senior Public School ","Riverdale Collegiate Institute","Danforth Collegiate & Technical Institute","Renovated Throughout","Hardwood Flooring Throughout Main & 2nd Floor’04","Two Renovated Bathrooms’04 & ‘08","200 Amp Service","Two Car Parking","Stainless Steel Appliances","New LG Ductless Plasma Air Conditioning System’10"]
["km000317","Sold","Family Residential",992,"Warden Avenue",349900,null,"Great Investment Opportunity!","Steps to TTC, Shopping, Parks & Schools!","WARDEN/LAWRENCE"," 43°44'10.53\"N"," 79°17'28.90\"W",43.736258333333332,-79.291361111111115,null,null,null,null,"20 x 120 Feet","$2,229.09/2010","2+1","Detached Garage + 1 Car Parking","1x4",null,null,"Immediate/TBA","Geroge Peck Public Scool","George Peck Public School","Wexford Collegiate Institute, Bendale BTI","Roof Replaced","New Garage Roof","New Back Entrance Addition","New Bathroom","Updated Kitchen","100 Amp Service","Mostly Updated Windows"]
["km000318","ARCHIVE","Condo",5,"Vicora Linkway #711",169900,null,"Perfect for First Time Buyers!","Schools, Parks, TTC & DVP at Your Doorstep!","DON MILLS/EGLINTON"," 43°42'42.16\"N"," 79°19'26.64\"W",{"$f":"IF(ISBLANK(K260),\"\",DMS_to_Dec(K260))","v":43.711711111111114},{"$f":"IF(ISBLANK(L260),\"\",DMS_to_Dec(L260))","v":-79.324066666666667},null,null,null,null,null,"$1,395.35/2010",3,"1 Underground Spot #175","1x4, 1x2","$595.26 (includes water, heat, hydro, cable, building insurance, common elements & parking)","#35-7","30 Days/TBA","Gateway PS","Valley Park Middle School or Don Mills Collegiate Institute","Marc Garneau Collegiate Institute or Don Mills Collegiate Institute"]
["km000319","SOLD","Family Residential",2,"Geraldine Court",779900,null,"Large Updated Family Home in Don Mills Steps to All Amenities!","Lovely Private Back Garden with New Deck & Hot Tub!","LAWRENCE/UNDERHILL"," 43°44'44.93\"N"," 79°19'55.59\"W",{"$f":"IF(ISBLANK(K261),\"\",DMS_to_Dec(K261))","v":43.74581388888889},{"$f":"IF(ISBLANK(L261),\"\",DMS_to_Dec(L261))","v":-79.332108333333323},null,null,null,null,"42.22 x 139.12 Feet","$5,012.50/2010","4+1","Double Car Garage + 6 Car Parking","1x6, 1x5, 1x4, 1x2",null,null,"60-90 Days/TBA","Cassandra Public School","Milne Valley Middle Shool","Victoria Park Collegiate Institute","Updated Kitchen","Central Air Conditioning ‘08","Furnace ‘08","100 Amp Service","Renovated Lower Level","All Updated Bathrooms","Main Floor Family Room"]
["km000320","ARCHIVE","Family Residential",15,"Gleneita Street",719900,null,"New & Spacious Detached 2 Storey!","Lots of $$$$ Spent on Upgrades!!!","ST.CLAIR/MIDLAND",null,null,null,null,null,null,null,null,"34 x 109.4 Feet","To Be Determined by the City","4+1","Double Car Garage + 2 Car Parking","1x5, 1x4, 1x2",null,null,"60-90 Days/TBA","John A. Leslie Public School","John A. Leslie Public School","RH King Academy, D & M Thomson Collegiate Institute & Sir Robert L. Borden","Premium Pie Shaped Lot","Energy Star & L.E.E.D. Certified","Centimeter Remote Control for Per Minute Energy Use","200 Amp Service","Hot Water on Demand","Central Air Conditioning","Commercial Grade Stainless Steel Appliances","Main Floor Family Room","Fully Finished Lower Level"]
["km000321","ARCHIVE","Family Residential",301,"Mortimer Avenue",339900,null,"Great Investment Opportunity! Steps to Danforth!","TTC & Subway at Your Doorstep!","PAPE/MORTIMER"," 43°41'13.17\"N"," 79°20'32.02\"W",{"$f":"IF(ISBLANK(K263),\"\",DMS_to_Dec(K263))","v":43.686991666666664},-79.342227777777779,null,null,null,null,"27.5 x 90 Feet","$2,678.59/2010",2,"Detached Garage + 2 Car Parking","1x4",null,null,"30 Days/TBA","Chester Elementary School","Westwood Middle School","East York Collegiate Institute, Danforth C&TI"]
["km000322","SOLD","Family Residential",260,"St. Clements Avenue",699900,null,"Detached 2 Storey Steps to Avenue Road Shops!","Finished Lower Level was Dug Out and has all New Windows!","ROSEWELL/ST CLEMENTS"," 43°42'40.50\"N"," 79°24'27.23\"W",43.71125,-79.407563888888888,null,null,null,null,"25 x 80 Feet","$5,000.03/2010",3,null,"1x4, 1x3",null,null,"Dec.2010/TBA","Allenby Junior Public School","Glenview Senior Public School","North Toronto Collegiate Institute  ","Newer Irpina Kitchen","Stainless Steel Amana Kitchen Appliances","Newly Renovated Lower Level ‘08","New Copper Plumbing","New Drains to the Lot Line ‘08","Landscaped Front Yard’00 & Back Yard’05","100 Amp Service","Central Air Conditioning","Allenby School District"]
["km000323","SOLD","Family Residential",6,"Winsloe Avenue",899900,null,"Spacious and Detached! Well Maintained Leaside Home!","Private Back Garden Newly Landscaped in '05!","BAYVIEW/EGLINTON"," 43°42'49.25\"N"," 79°22'29.97\"W",43.713680555555555,-79.374991666666659,null,null,null,null,"33.40 x 120 Feet","$5,988.41/2010",3,"Double Car Garage + 5 Car Parking","1x4, 1x3",null,null,"90 Days/TBA","Northlea E & MS","Northlea E & MS","Leaside High School","200 Amp Service","Furnace with Hepa Filter ‘03","Central Air Conditioning ‘04","Landscaped Back Garden ‘05","Roof’00","Garage Roof’00","New Plumbing Lines to the City","Mostly Updated Windows"]
["km000324","SOLD","Family Residential",104,"Cottonwood Drive",549900,null,"Attention First Time Home Buyers, Renovators or Builders!","Great Lot in Sought After Don Mills Neighbourhood!","DON MILLS/LAWRENCE"," 43°43'48.63\"N"," 79°20'32.38\"W",{"$f":"IF(ISBLANK(K266),\"\",DMS_to_Dec(K266))","v":43.730175000000003},-79.342327777777768,null,null,null,null,"51.31 x 129.81ft Rear 66ft","$3,716.80/2010",3,"1 Car Carport + 2 Car Parking","1 x 4, 1 x 2 Piece",null,null,"Immediate/TBA","Greenland PS */ Norman Ingram PS ","Don Mills CI","Don Mills CI","100 Amp Service","Ductless Air Conditioning '08"]
["km000325","SOLD","Condo",18,"William Carson Crescent #103",459900,null,"Luxury Hillside! Fabulous Location on Ground Level with Hillside Private Views of Beautiful Landscaped Gardens","Model Suite! Spacious 2 Bedroom Split Plus Den Shows To Perfection","YONGE/YORK MILLS"," 43°44'53.26\"N"," 79°24'24.68\"W",43.748127777777782,-79.406855555555566,null,null,null,null,null,"$2,757.49/2010","2+1","1 Underground Parking Spot (close to elevator)","2 x 4 Piece","$769.67/mo (includes: basic Rogers cable, water, gas, hydro, parking, air conditioning, building insurance & common elements)","1 Owned Locker","January 2011 or TBA","Armour Heights PS */ Owen PS  ","St Andrew's JHS ","York Mills CI  ","9 Acre Park-Like Setting","2 Walkouts to Large Private Patio","24 Hour Concierge and Gatehouse","Close to Shops, Subway, Ttc and Restaurants"]
["km000326","SOLD","Family Residential",10,"Fordham Place",599900,null,"Land Value! Great Lot on Demand Cul-de-sac in One of the Most Sought After Don Mills Neighbourhood","Steps to Greenbelt, parks and 'The Shops at Don Mills'","LAWRENCE/THE DONWAY W"," 43°44'33.68\"N"," 79°21'6.72\"W",43.742688888888893,-79.351866666666666,null,null,null,null,"60 x 110 Feet","$3,889.55/2009",2,"3 Car Parking","1 x 4 Piece",null,null,"Dec.2010/TBA","Greenland PS */ Norman Ingram PS ","Don Mills CI","Don Mills CI","Property Sold As Is"]
["km000327","ARCHIVE","Family Residential",28,"The Carriage Way",299900,null,"Spacious Townhome!","Great Opportunity for First Time Buyer!","BAYVIEW/HWY 7/407"," 43°49'50.84\"N"," 79°24'20.39\"W",{"$f":"IF(ISBLANK(K269),\"\",DMS_to_Dec(K269))","v":43.83078888888889},-79.405663888888895,null,null,null,null,null,"$2119.34/2010",3,"1 Car Parking #42","1 x 4, 1 x 2 Piece","$264.74/mo (includes water, parking, building insurance and common elements)",null,"90 Days or TBA",null,null,null,"New windows '10","New Broadloom","Furnace '07","Newer Kitchen","Freshly Painted","Hardwood Flooring","New Wooden Deck","Short Walk to GO Train, Shops & Restaurants"]
["km000328","SOLD","Family Residential",11,"Southwell Drive",699900,null,"Gorgeous Layout with Cathedral Ceilings Throughout!","Hardwood Flooring, Updated Windows and Spacious! Move in and Enjoy!","LESLIE/YORK MILLS"," 43°44'46.18\"N"," 79°21'26.38\"W",43.746161111111114,-79.357327777777769,null,null,null,null,"60 x 125 Feet",3937.35,4,"Single Car Garage + 4 Car Parking","1x4, 1x3",null,null,"Feb. 2011/TBA","Rippleton Public School","St. Andrew's Junior High School, Windfields Junior High School","York Mills Collegiate Institute","Roof '02","100 Amp Service","Central Air Conditioning '10","Furnace '02","Cutler Helmet Eaves"]
["km000329","SOLD","Family Residential",64,"Doonaree Drive",789900,null,"Rare 1/3 Acre Ravine Lot in Don Mills!","Spacious and Move-in Condition! Lots of Natural Light!","LAWRENCE/UNDERHILL"," 43°44'42.20\"N"," 79°19'54.92\"W",43.74505555555556,-79.331922222222218,null,null,null,null,"Ravine Lot: 58 x 173.89 Feet","$4,869.22/2010","3+1","Double Car Garage + 6 Car Parking","2x4, 1x3",null,null,"May 2011/TBA","Cassandra Public School","Milne Valley Middle School","Victoria Park Collegiate Institute","1/3 of an Acre Ravine Lot","All Updated Bathrooms","Secluded and Private Setting","Located on Quiet Court","100 Amp Service"]
["km000330","SOLD","Family Residential",1,"Treadgold Crescent",689900,null,"Renovated from Top to Bottom! Simply Gorgeous!","Cathedral Ceilings & Gourmet Kitchen!","YORK MILLS/DVP"," 43°45'23.69\"N"," 79°19'25.26\"W",{"$f":"IF(ISBLANK(K272),\"\",DMS_to_Dec(K272))","v":43.756580555555558},-79.323683333333335,null,null,null,null,"75 X 105 Feet","$4,676.78/2010",2,"3 Car Parking","2x4",null,null,"April 2011/TBA","Ranchdale Public School","Donview Middle School","Victoria Park Collegiate Institute","Completely Renovated","Gourmet Kitchen with Stainless Steel Appliances","Cathedral Ceilings","Hardwood Flooring Throughout","100 Amp Service","Central Vacuum","Central Air Conditioning","Built-in Zoned Speakers Throughout Main & Upper Levels with Four Panels in Each Room","All Updated Windows","Large Corner Lot with Beautiful Gardens in Front & Back Gardens","Availability to build an Extension"]
["km000331","SOLD","Family Residential",429,"Broadway Avenue",889900,null,"Spacious & Gracious Leaside Home!","Large Private Back Garden!  Main Floor Family Room!","BAYVIEW/EGLINTON"," 43°42'51.67\"N"," 79°22'28.30\"W",43.714352777777783,-79.374527777777772,null,null,null,null,"Front: 35 Feet, East: 135 Feet, West: 125 Feet","$6,275.63/2010",3,"Single Car Garage + 2 Car Parking","2x4",null,null,"120 Days/TBA","Northlea E & MS","Northlea E & MS","Leaside High School","Ductless Air Conditioning ‘00","Roof ‘01","Furnace’09","Tankless Hot Water & Boiler","Mostly Updated Windows","100 Amp Service","All Three Exterior Steel Doors ‘07","Updated Water Line Connection to City"]
["km000332","SOLD","Condo",95,"Rameau Drive #3",299900,null,"Great Opportunity for First Time Buyer or Investment!","Spacious Living in Steps to All Amenities!","DON MILLS/FINCH"," 43°47'31.94\"N"," 79°21'34.27\"W",43.792205555555554,-79.359519444444445,null,null,null,null,null,"$2,176.09/2010",3,"Single Car Garage + One Car Parking","1x4, 1x2","$319.48/month includes: water, parking, basic cable, building insurance & common elements)",null,"Immediate/TBA","Cresthaven Public School","Zion Heights Junior High School","A.Y. Jackson Secondary School","In Your Neighbourhood","Old Cummer GO Train Station","Skymark Place Shopping","Fairview Mall Shopping Centre","Shops on Steeles & 404","Seneca College – Newnham Campus","TTC, DVP & Highway 401"]
["km000333","ARCHIVE","Family Residential",129,"Braemar Avenue (Upper Level)",null,2800,"Fabulous Location! ","Spacious Living on the Upper Level!","AVENUE/EGLINTON"," 43°42'13.95\"N"," 79°24'33.78\"W",{"$f":"IF(ISBLANK(K275),\"\",DMS_to_Dec(K275))","v":43.703875000000004},-79.409383333333338,null,null,null,null,null,null,null,"Carport","1x5, 1x4",null,null,"Immediate","Oriole Park Junior Public School","Hodgson Senior Public School","North Toronto Collegiate Institute  ","Renovated Throughout","Master Bedroom has Ensuite!"]
["km000334","SOLD","Family Residential",66,"Hobart Drive",749900,null,"Spacious Manor Steps to All Amenities!","Fantastic Family Neighbourhood!","DON MILLS/SENECA HILL"," 43°47'24.20\"N"," 79°21'5.12\"W",43.790055555555554,-79.351422222222212,null,null,null,null,"50 x 120 Feet","$4,360.49/2010",4,"Double Car Garage + 4 Car Parking","2x4, 1x3, 1x2 ",null,null,"May 15/TBA","Seneca Hill Public School ","Don Valley Junior High School","George Vanier Secondary School","Roof’06","Carrier Furnace’99","Lennox Central Air Conditioning","100 Amp Service","Main Floor Family Room","Main Floor Laundry Room with Separate Entrance","Mostly Updated Windows"]
["km000335","SOLD","Family Residential",25,"Ravenrock Court",299900,null,"Super Opportunity for First Time Buyer or Investor!","Large Lot! Hardwood Flooring Throughout Second Level!","YORK MILLS/VICTORIA PARK"," 43°45'42.03\"N"," 79°19'11.89\"W",43.761674999999997,-79.319969444444439,null,null,null,null,"37.28 x 125 Feet","$2,944.38/2010",3,"Single Car Garage + 2 Car Parking","1x4, 1x2",null,null,"30 Days/TBA","Roywood PS","Donview Middle School","Victoria Park Collegiate Institute","Roof'10","100 Amps"]
["km000336","SOLD","Condo","17D","Overlea Boulevard",439900,null,"Great Opportunity! Steps to Schools, Parks & All Amenities!","Spacious Townhome with Loft Potential!","MILLWOOD/OVERLEA"," 43°42'13.47\"N"," 79°21'3.30\"W",{"$f":"IF(ISBLANK(K278),\"\",DMS_to_Dec(K278))","v":43.703741666666673},{"$f":"IF(ISBLANK(L278),\"\",DMS_to_Dec(L278))","v":-79.350916666666663},null,null,null,null,null,"$2,753.36/2011","3+1","Double Car Garage","2x4, 1x3, 1x2","$115/month (includes: exterior maintenance, parking, common expenses & building insurance)",null,"May 2011/TBA","Thonrcliffe Park Public School","Valley Park Middle School ","Marc Garneau Collegiate Institute ","Newly Constructed Complex ‘99","Central Air Conditioning","Loft Potential Available","100 Amp Service","Access to five TTC routes, subway & DVP"]
["km000337","ARCHIVE","Family Residential",14,"Penwood Crescent",2575000,null,"Rare Renovated Beauty Overlooks Windfields Park!","Gourmet Kitchen! Fireplaces & Walk-outs! A Must See!","DENLOW/LESLIE"," 43°44'32.32\"N"," 79°22'22.30\"W",{"$f":"IF(ISBLANK(K279),\"\",DMS_to_Dec(K279))","v":43.742311111111114},{"$f":"IF(ISBLANK(L279),\"\",DMS_to_Dec(L279))","v":-79.372861111111106},"http://www.karenmillar.com/spotlight_slideshow.php?id=km000337",null,null,null,"79.43 x 139.71 – Rear: 120 Feet","$15,706.08/2010","5+1","Double Car Garage & Double Car Parking","1x6, 1x5, 1x4, 3x3, 1x2, 1x1",null,null,"90 Days/TBA","Denlow Public School","Windfields Junior High School","York Mills Collegiate Institute","Denlow School District!!","Overlooks Windfields Park","Renovated Throughout","Roof’08","Central Air Conditioner ‘09","Two Forced Air Furnaces’09","Two Electric Air Cleaners","Two Humidifiers","Security System with Motion Detector","Intercom System Throughout","Heated Porcelain Flooring Throughout Main Floor","In-ground Heated Concrete Pool with Waterfall","Main Floor Family Room","Main Floor Laundry","Central Vacuum"]
["km000338","SOLD","Family Residential",52,"Woodgrove Trail",549900,null,"Super Spacious 3 Storey Freehold Townhouse Overlooking Park!","Finished Lower Level has Rare High Ceilings!","KENNEDY/ANGUS GLEN",null,null,null,null,null,null,null,null,null,"$3,612.50/2011","3 + 1","Double Car Garage","1 x 5, 1 x 4, 1 x 2 Piece",null,null,"June 2011 or TBA","Unionville Montessori/Buttonville Elementary School (JK-8)","Pierre Elliot Trudeau (9-12)",null,"Newly Shingled Roof '09","Hardwood Flooring Throughout Main Level","Nine Foot Ceiling Throughout Main Level","Central Air Conditioning","Central Vacuum","100 Amp Service","Professionally Landscaped Front & Back Gardens","New Front Stair Railings Fall'10"]
["km000339","ARCHIVE","Family Residential",619,"Mortimer Avenue",319000,null,"Great Location!","Attention Builder or Renovator!","WOODBINE/MORTIMER"," 43°41'28.39\"N"," 79°19'16.18\"W",{"$f":"IF(ISBLANK(K281),\"\",DMS_to_Dec(K281))","v":43.691219444444442},-79.32116111111111,null,null,null,null,"31.92 x 100.33 Feet","$2,487.56/2010",2,"Two Car Parking","1x4",null,null,"30 Days/TBA","RH McGregor Elementary School","Cosburn Middle School","East York Collegiate Institute, Danforth C&TI"]
["km000340","SOLD","Condo",95,"Dutch Myrtle Way",469900,null,"Spacious 3 Storey Don MIlls Townhouse! Steps to Schools, Parks, Transportation & The Shops at Don Mills!","Second Floor Family Room! Dining Room has Cathedral Ceiling!","DON MILLS/LAWRENCE"," 43°44'23.66\"N"," 79°20'33.99\"W",43.739905555555559,-79.342774999999989,null,null,null,null,null,"$2,807.33/2010",3,"Single Car Garage + 1 Car Parking","2x4, 1x3, 1x2","$420/month (includes: water, basic cable, building insurance, common elements & parking)",null,"May 2011/TBA","Greenland Public School, Norman Ingram Public School","Don Mills Middle School","Don Mills Collegiate Institute","Steps to School, Parks, Shopping & Transportation","Second Floor Family Room","California Style Blinds Throughout","Central Air Conditioning","100 Amp Service"]
["km000341","SOLD","Family Residential",140,"Albertus Avenue",999900,null,"Exceptional & Spacious Home in Prestigious Lytton Park!","Steps to Subway, Yonge Street Shopping & Restaurants, Schools & Parks!","LYTTON/DUPLEX"," 43°42'49.87\"N"," 79°24'14.67\"W",43.713852777777781,-79.404075000000006,null,null,null,null,"31 x 141 Feet","$6,565.66/2010",3,"Private Driveway with Three Car Parking","1x5, 1x3 Piece",null,null,"July 2010 or TBA","John Ross Robertson Junior Public School","Glenview Senior Public School","Lawrence Park Collegiate Institute, North Toronto Collegiate Institute","200 Amp Service Updated’ 04","Copper Plumbing’04","¾” Water Service’04","PVC Drain Pipes","Main Floor Family Room","Stainless Steel Appliances","Roof ‘08","Two Mitsubishi Ductless Air Conditioners","Wired with Chubb Security System"]
["km000342","ARCHIVE","Family Residential",23,"Mogul Drive",599900,null,"Super Location!","Attention Renovators! Great Opportunity!","DON MILLS/McNICOL"," 43°48'5.35\"N"," 79°21'4.67\"W",{"$f":"IF(ISBLANK(K284),\"\",DMS_to_Dec(K284))","v":43.80148611111111},-79.351297222222215,null,null,null,null,"50.66 x 120 Feet","$4,161.16/2010",4,"Built-in Double Car Garage + 4 Car Parking","1 x 5, 1 x 4, 1 x 3, 1 x 2 Piece",null,null,"30 Days or TBA","Hillmount Public School","Highland Junior High School","A.Y. Jackson Secondary School"]
["km000343","SOLD","Family Residential",8,"Silverdale Crescent",1998800,null,"Rare Ravine Lot with 300 Feet of Tableland!","Beautifully Renovated Rejuvenated Home! Perfect for Entertaining!","DON MILLS/YORK MILLS"," 43°45'22.91\"N"," 79°20'28.67\"W",43.756363888888892,-79.341297222222224,"http://tours.advirtours.com/119766p",null,null,null,"105 x 300 Feet (Ravine)","$9,294.09/2010","4+2","Double Car Garage + 8 Car Parking","2x4,2x3,1x2",null,null,"Immediate/TBA","Three Valleys Public School","Milne Valley Middle School","George S Henry Academy","Rare Ravine Lot","Underground Sprinkler System","Security System","Cabana with 3 Piece Bathroom and 2 Change Rooms","Backup Generator","New Kitchen'11","New Master Suite with 4 Piece Ensuite'11","Main Floor Family Room","Nanny & Inlaw Suites"]
["km000344","SOLD","Family Residential",111,"Three Valleys Drive",669900,null,"Super Opportunity in Great Donalda Neighborhood!","Super Family Home!","DON MILLS/YORK MILLS"," 43°44'53.40\"N"," 79°20'14.35\"W",43.74816666666667,-79.337319444444447,null,null,null,null,"60 x 100 Feet","$4,439.40/2010","3+1","Single Car Garage + 2 Car Parking","1x4, 1x2",null,null,"60 Days/TBA","Three Valleys Public School","Milne Valley Middle School","George S Henry Academy"]
["km000345","ARCHIVE","Family Residential",739,"Craven Road",242900,null,"Attention Renovator's & Builder's!","Super Location!","COXWELL/N. of GERRARD"," 43°40'32.30\"N"," 79°19'21.12\"W",{"$f":"IF(ISBLANK(K287),\"\",DMS_to_Dec(K287))","v":43.675638888888884},-79.322533333333325,null,null,null,null,"12.42 x 73 Feet","$1,536.56/2010",2,null,"1 x 3 Piece",null,null,"30 Days or TBA"]
["km000346","SOLD","Family Residential",101,"Rykert Crescent",1198800,null,"Fabulous North Leaside Residence","Bursting with Light and Open Space!","EGLINTON/BRENTCLIFFE"," 43°43'0.76\"N"," 79°21'23.78\"W",43.716877777777782,-79.356605555555547,null,null,null,null,"40 x 125 Feet","$7,491.74/2010",4,"Single Car Garage with Private Drive + 2 Car Parking","1 x 4, 1 x 3, 1 x 2 Piece",null,null,"May 2011/TBA","Northlea E & MS","Northlea E & MS","Leaside High School","Addition '00","Lower Level Addition '00 - Original Recreatino Room Lowered","Heated Flooring in Addition and Lowered Basement","New Windows Thoughout '00","Kitchen '00","A/C Spac Pak","Wired Throughout Most Rooms for Internet/Tv Cable","Owned Alarm System","Roof Reshingled '00","Three Heating Zones","Skylights","Hardwood Flooring Throughout Main & Upper Level","Updated Plumbing","200 Amp Service","Main Floor Laundry Roughed-in","Freshly Painted Interior"]
["km000347","SOLD","Family Residential",5,"Early Appleway",289900,null,"Super Opportunity for 1st Time Buyer or Investment!","Stunning Townhome Renovated in 2006","VICTORIA PARK/LAWRENCE"," 43°44'38.69\"N"," 79°18'49.31\"W",43.744080555555556,-79.313697222222217,null,null,null,null,null,"$1885.39/2010",3,"Single Carport","1 x 4, 1 x 2 Piece","$315/mo (includes Cable +1, water, common elements, building insurance, parking, landscaping and snow removal)",null,"August 2011/or TBA","Cassandra PS/Ranchdale PS","Milne Valley MS","Victoria Park CI","Roof '10","New Hardwood Flooring '06","New Kitchen '06","New Bathrooms '06","Backs on to Green space","Private back garden","100 amp service","Central Air Conditioning","Freshly Painted Throughout","Private Parking","Visitor Parking","All New Stainless Steel Kitchen Appliances '06","Central Vacuum"]
["km000348","SOLD","Family Residential",3,"Tetbury Crescent",1498900,null,"Gorgeous Renovated Home In Sought After Donalda Neighbourhood!","Gourmet Kitchen with Solarium Overlooking Park","DON MILLS/YORK MILLS"," 43°45'12.75\"N"," 79°20'20.44\"W",{"$f":"IF(ISBLANK(K290),\"\",DMS_to_Dec(K290))","v":43.753541666666663},-79.339011111111105,null,null,null,null,"130.1 x 92.75 Rear: 137: North side: 128 Feet on to Park","$7,794.91/2010",5,"Double Car Garage + 4 Car Parking","2x5, 2x3, 1x2",null,null,"60 Days/TBA","Three Valleys Public School","Milne Valley Middle School","George S Henry Academy","Stunning renovation throughout","200 Amp Service","Main Roof'09 & Flat Roof '10","Furnace'09","Central Air Conditioning’10","Central Vacuum","New Kitchen","New Bathrooms","Backs & sides on to Park","Exceptional Lot"]
["km000349","SOLD","Family Residential",41,"Clydesdale Drive",459900,null,"Great Starter Home!","Super Spacious Semi in Family Friendly Neighborhood!","SHEPPARD/BRIAN"," 43°46'55.07\"N"," 79°19'46.77\"W",43.781963888888889,-79.329658333333327,null,null,null,null,"30.09 x 120 Feet","$2,695.21/2010",4,"Four Car Parking ","1x4, 2x2",null,null,"July/ 2011/TBA","Brian Public School","Pleasant View Junior High School","Sir John A MacDonald Collegiate Institute","Lower Roof Redone ","Mostly New Windows","Widened Driveway","Large Private Backyard","Freshly Painted Throughout ","100 Amp Service ","Central Air"]
["km000350","SOLD","Family Residential",18,"Glenorchy Road",3500000,null,"Exquisite Bridlepath Residence Backing on to Ravine!","Stunning 2 Storey with Grand Entrance, Beautifully Updated & Unique Architectural Design!","BRIDLEPATH/PARK LANE"," 43°43'39.42\"N"," 79°21'54.43\"W",43.72761666666667,-79.365119444444446,"http://tours.advirtours.com/120091p",null,null,null,"109.4x138 Feet","$15,369.71/2010","5+2","Double Car Garage + Circular Lockstone Driveway","3x5, 1x4, 2x3, 1x2",null,null,"Immediate/TBA","Rippleton Public School, Denlow Public School","St. Andrews Junior High School","York Mills Collegiate Institute","Backs on to Ravine","Roof '00","200 Amp Service","High Efficiency Furnace'99","Central Air'99","Double Car Garage","Completely Fenced Backyard","Circular lockstone Driveway ‘10","Gourmet Kitchen with Granite Counter Top, Centre Island & Fantastic Appliances"]
["km000351","SOLD","Family Residential",35,"Sagebrush Lane",799900,null,"Rare Ravine Lot on Sought After Street!","Spacious Updated Bungalow!","DON MILLS/YORK MILLS"," 43°45'26.32\"N"," 79°19'54.83\"W",{"$f":"IF(ISBLANK(K293),\"\",DMS_to_Dec(K293))","v":43.757311111111115},-79.331897222222224,null,null,null,null,"Front 68.42    Rear 64.18     West 133.74 East 149.94","$4,904.52/2010",3,"Double Car Garage + 4 Car Parking","1x4, 1x3, 1x2",null,null,"30 Days/TBA","Ranchdale Public School","Donview Middle School","Victoria Park Collegiate Institute","Roof Approximately 4 years","Furnace’09","Central Air ’03","All Updated Windows","Alarm System","Update Kitchen ","Updated Bathrooms","Underground Sprinkler System in Back and Front","Ravine Lot"]
["km000352","SOLD","Family Residential",187,"Dallimore Circle",549900,null,"Updated Throughout! Super Corner Townhouse!","Spacious Three Bedroom with Finished Lower Level!","DON MILLS/EGLINTON"," 43°43'49.87\"N"," 79°19'59.95\"W",43.730519444444447,-79.333319444444442,"http://www.karenmillar.com/spotlight_slideshow.php?id=km000352",null,null,null,"23.98 x 79.4 Feet","$3,251.69/2010",3,"Single Car Garage + 1 Car Parking","2x4, 2x2",null,null,"Immediate/TBA","Greenland Public School, Norman Ingram","Don Mills Middle School","Don Mills Collegiate Institute"]
["km000353","SOLD","Family Residential",24,"Ferndale Avenue",783100,null,"Super Potential But Needs TLC!","Sought After Neighbourhood!","YONGE/ST.CLAIR"," 43°41'22.38\"N"," 79°23'30.69\"W",43.689549999999997,-79.391858333333346,null,null,null,null,"25 X 125 Feet","$6,299.88/2010",5,"None","1x4, 1x2",null,null,"30 Days/TBA","Deer Park Juinior & Senior Public School","Deer Park Juinior & Senior Public School","Jarvis Collegiate Institute"]
["km000354","SOLD","Family Residential",19,"Ashgrove Place",649900,null,"Brand New Kitchen with Bamboo Cabinetry & Stainless Steel Appliances!","Move-in and Enjoy! Private Ravine Lot!","DON MILLS/LAWRENCE"," 43°44'31.71\"N"," 79°20'32.96\"W",{"$f":"IF(ISBLANK(K296),\"\",DMS_to_Dec(K296))","v":43.742141666666669},-79.34248888888888,null,null,null,null,"50 x 154.02 Feet","$3,463.48/2010",3,"Carport + 3 Car Parking","2x4",null,null,"30-60 Days/TBA","Greenland Public School, Norman Ingram","Don Mills Middle School","Don Mills Collegiate Institute","Ravine Lot","All New In-line Windows’09","Upgraded Internal Electric System to 100 Amp Service","Refinished Hardwood Flooring Throughout Main and Second Level","New Phone & Cable Lines Installed by Rogers","New High Efficiency Furnace","New Air Conditioner","New In-line Water Heater","Upgraded Insulation in Attic.","Freshly Painted Throughout","Ducts Cleaned"]
["km000355","SOLD","Family Residential",126,"Willow Avenue",529900,null,"Great Opportunity Steps to Queen Street & The Boardwalk!","Build New on this Sought After Street!","QUEEN/WILLOW"," 43°40'25.11\"N"," 79°17'11.98\"W",43.673641666666661,-79.286661111111115,null,null,null,null,"25 x 121.33 Feet",null,2,"Detached Garage ","1x4",null,null,"60-90 Days/TBA","Balmy Beech Community School","Glen Ames Senior Public School","Malvern Collegiate Institute, Danforth C&TI, Monarch Park Collegiate Institute","The Boardwalk","The Martin Goodman Trail","Ashbridge’s Bay Park","Glen Stewart Park","Donald Summerville Pool (at Woodbine)","Kew Gardens","The Beach Public Library","Queen Street & Kingston Road Shopping & Restaurants","Main Street Subway Station","Streetcar Routes along Queen Street, Kingston Road, Gerrard Street, Victoria Park Avenue & Woodbine Avenue","Minutes to Don Valley Parkway, Gardiner Expressway & Lake Shore Boulevard"]
["km000356","ARCHIVE","Luxury",5,"Royal Oak Drive",4388000,null,"Luxury Resides Here! Denlow School District!","New Custom Designed Home with All the Bells & Whistles!","BRIDLEPATH/PARK LANE"," 43°43'38.38\"N"," 79°21'49.15\"W",43.727327777777781,-79.363652777777773,"http://www.karenmillar.com/spotlight_slideshow_km000356.php?id=km000356",null,null,null,"103 x 148.14 Feet","$19,389.67/2010","4+1","Triple Car Garage + Interlocking Brick Circular Driveway","2x5, 2x4, 2x3, 1x2",null,null,null,"Rippleton Public School, Denlow Public School","St. Andrews Junior High School","York Mills Collegiate Institute","Wireless Avante Security System for Motion & Windows","400 Amp Service, Central Vacuum, Nimbus Water Softener","Two High Efficiency Furnaces’10 with Electric Cleaners & Humidifiers","Two Central Air Conditioners ’08 & ‘10","Main Floor Family Room & Library","New Heated Inground Concrete Pool with Carrera Colored Marbonite & Black Coping ","Fully Insulated Home for Better Energy Savings","Professionally Landscaped Front & Back Gardens","Mansard Roof with 80% Cedar Shakes","Gourmet Custom Kitchen & Appliances, Rubinet & Graff Taps & Faucets","Calcutta Gold, Thassos or Statuario 36x36 Marble Flooring Throughout + All Marble in Home Purchased as Slabs & Custom Cut to Largest Size Possible ","Custom Window Coverings Throughout, Four Inch Dark Stained Oak Flooring Throughout","Over 350 Low Voltage Pot Lights, Napoleon Gas Fireplaces with Custom Marble Mantles & Remotes","Flat Screen TV’s & Built-in Bose Surround Sound Systems with Intelligent Harmony Remotes","Custom Designed Pillared for Main Floor Wide Room Entrances, 36” Plaster Wainscotting on all Three Floors"]
["km000357","SOLD","Family Residential",22,"Dukinfield Crescent",479900,null,"Super Opportunity for First Time Buyer!","This Charmer is in Ready, Set & Go Condition!","YORK MILLS/DVP"," 43°45'44.47\"N"," 79°20'2.42\"W",{"$f":"IF(ISBLANK(K299),\"\",DMS_to_Dec(K299))","v":43.762352777777778},-79.334005555555549,null,null,null,null,"42x104.36 Feet","$3,467.64,2010",3,"Tandem Car Garage + 2 Car Parking","1x4, 1x3",null,null,"Immediate/TBA","Fenside Public School","Donview Middle School","George S Henry Academy","Furnace '03","Central Air Conditioning '03","100 Amp Service","New Gas Fireplace","Windows Replaced"]
["km000358","ARCHIVE","Family Residential",19,"Nightingale Place",254900,null,"Builder's Delight!","Steps to Schools, Parks, TTC & The GO Train!","LAWRENCE/SCARBORO G.C."," 43°45'51.73\"N"," 79°12'36.11\"W",43.764369444444448,-79.210030555555562,null,null,null,null,"44 x 148 Feet","$2,333.90/2010",3,"Carport + 2 Car Parking","1x4, 1x2",null,null,"30 Days/TBA","Golf Road Junior Public School","Tecumseh Senior Public School","Cedarnrae Collegiate Institute, Sir Robert L Borden BTI, Maplewood High School"]
["km000359","ARCHIVE","Luxury",16,"Glenorchy Road",null,null,null,null,"BRIDLEPATH/PARK LANE"," 43°43'42.29\"N"," 79°21'55.54\"W",43.728413888888888,-79.365427777777768,"http://www.karenmillar.com/spotlight_slideshow_km000359.php?id=km000359",null,null,null,"120 x 135 Feet","$15,272.11/2010",7,"Double Car Garage, Double Carport + 6 Car Parking","1x6, 1x5, 2x4, 1x3, 1x2",null,null,"30/60 Days/TBA","Rippleton Public School, Denlow Public School","St. Andrews Junior High School","York Mills Collegiate Institute"]
["km000360","SOLD","Family Residential",171,"Pickering Street",399900,null,"Fantastic Upper Beach Location Steps the the Boardwalk & Shopping!","Wonderfull Upgrades! Move in and Enjoy!","N. OF KINGSTON RD/PICKERING"," 43°41'1.85\"N"," 79°17'29.27\"W",{"$f":"IF(ISBLANK(K302),\"\",DMS_to_Dec(K302))","v":43.683847222222219},-79.291463888888885,null,null,null,null,"13.92 x 91 Feet","$2,497.94/2010",2,"Garage + 1 Car Parking","1x4",null,null,"60 Days/TBA","Adam Beck Junior Public School","Glen Ames Senior Public School","Malvern Collegiate Institute, Danforth C&TI, Monarch Park Collegiate Institute","All New Electrical","New Kitchen","New 4 Piece Bathroom","New Engineered Flooring Throughout","Central Air Conditioning","Steps to The Beach","Great Shops on Kingston Road and Queen Street"]
["km000361","SOLD","Family Residential",17,"Farmcote Road",798800,null,"Renovated Bungalow in Super Don Mills Location!","Rare Large Don Mills Lots! Quiet and Private!","DON MILLS/LAWRENCE"," 43°44'45.34\"N"," 79°20'36.64\"W",43.74592777777778,-79.343511111111113,null,null,null,null,"Front: 55.6 Rear: 105 North: 164 South 138 Feet","$4,476.77/2010","3+1","Carport + 4 Car Parking","1x4, 1x2",null,null,"60 Days/TBA","Greenland Public School, Norman Ingram","Don Mills Middle School","Don Mills Collegiate Institute","Rare Large Lot","Roof ‘99’","100 Amp Service","Furnace ‘99’","Newly Finished Lower Level","New Hardwood Flooring Throughout Main Level","New Kitchen","Two New Bathrooms"]
["km000362","ARCHIVE","Family Residential",2,"Minorca Place",899800,null,"Beautifully Renovated Home with Separate In-Law Suite!","Prestigious Donalda Golf Club Neighbourhood!","DON MILLS/YORK MILLS"," 43°45'9.13\"N"," 79°20'15.01\"W",43.752536111111112,-79.337502777777772,"http://www.karenmillar.com/spotlight_slideshow.php?id=km000362",null,null,null,"80 x 130.5 Feet","$6,328.94/2010 ","4+1","Four Car Parking ","1x5, 2x4, 1x3",null,null,"90 Days/TBA","Three Valleys Public School","Milne Valley Middle School","George S Henry Academy","New Gourmet Cellini Kitchen’04","Composite Roof’04","Two Central Vacuums","Central Air Conditioning","100 Amp Service","Located on Quiet Cul-de-Sac"]
["km000363","SOLD","Family Residential",12,"Lia Crescent",998800,null,"Ravine Property! Beautifully Updated Don Mills Home!","Spacious & Gracious Two Story Home!","LAWRENCE/UNDERHILL"," 43°44'43.73\"N"," 79°19'50.87\"W",43.745480555555559,-79.330797222222216,"http://www.karenmillar.com/spotlight_slideshow.php?id=km000363",null,null,null,"44.02 x 127 x 135 (across the back) Irregular Pie Shaped Lot","$5,207.68/2010","4+1","Double Car Garage + 2 Car Parking","2x4, 1x2",null,null,"60 Days/TBA","Cassandra PS/Ranchdale PS","Milne Valley MS","Victoria Park CI","Pella Windows’01","Central Vacuum’04","Roof’02","Carrier Furnace with Air Cleaner’00","Central Air Conditioning","100 Amp Service","Ravine Lot","Mature Quiet Crescent","Main Floor Den","Main Floor Family Room "]
["km000364","ARCHIVE","Family Residential",202,"Three Valleys Drive",null,3300,"Executive Family Home in Prestigious Donalda Neighbourhood!","Renovated from Top to Bottom! ","DON MILLS/YORK MILLS"," 43°44'40.38\"N"," 79°20'13.12\"W",{"$f":"IF(ISBLANK(K306),\"\",DMS_to_Dec(K306))","v":43.744550000000004},-79.336977777777776,"http://www.karenmillar.com/spotlight_slideshow.php?id=km000364",null,null,null,"76.83 x 103 Feet",null,3,"Detached Double Car Garage + 5 Car Parking","2x4, 1x3, 1x2",null,null,"End of April or TBA","Three Valleys Public School","Milne Valley Middle School","George S Henry Academy","All New Landscaping ’11","Complete Architectural Renovation","Four Designer Bathrooms","New Maple Hardwood Flooring Throughout","Two Fireplaces","New Double Car Garage","Top of the Line Kitchen Appliances","Gourmet Kitchen","100 Amp Service","Central Air Conditioning","Pella Windows & Patio Doors","Garden and Lawn Care Included in Lease Price"]
["km000365","SOLD","Family Residential",150,"Bedford Park Avenue",799900,null,"Updated 2 Storey in John Wanless School District!","Finished Lower Level with Nanny Suite!","YONGE/LAWRENCE"," 43°43'34.21\"N"," 79°24'33.85\"W",43.726169444444444,-79.409402777777785,"http://www.karenmillar.com/spotlight_slideshow.php?id=km000365",null,null,null,"20 x 125 Feet","$5,452.70/2010","3+1","1 Car Parking","1x4, 1x3",null,null,"90 Days/TBA","John Wanless Junior Public School","Glenview Senior Public School","Lawrence Park Collegiate Institute, Northern Secondary School","Central Air Conditioning","Furnace’00","New Large Hot Water Tank’11","100 Amp Service","New Roof’10","John Wanless, Blessed Sacrament,& Lawrence Park CI School Districts ","All New Windows","Alarm System with assumable monitoring","Renovated Interior","Remarkably Spacious","Top of the Line Appliances","Two New Bathrooms","Exquisite Principal Rooms with Hardwood Flooring & Soaring Ceilings"]
["km000366","ARCHIVE","Family Residential",12,"Hockley Place",898900,null,"Renovated Home on Ravine!","Upgrades Galore!","BROOKBANKS/RAVINE"," 43°45'33.11\"N"," 79°19'44.03\"W",43.75919722222222,-79.328897222222224,"http://www.karenmillar.com/spotlight_slideshow.php?id=km000366",null,null,null,"40 x 135 Feet (irregular ravine lot, Rear: 142 Feet)","$5,074.78/2010","2+1","Single Car Garage + 2 Car Parking","1x5, 1x3",null,null,"Sept. 2011/TBA","Ranchdale Public School","Donview Middle School","Victoria Park Collegiate Institute","Ravine Property","Quiet Cul-de-Sac","Wireless & Wired Alarm System","Roof '08","Central Air Condtioning","Two New Bathrooms","100 Amp Service","Updated Windows","New Gourmet Kitchen","New Pot Lights","Main Floor Family Room","New Upper Level Laundry Room","Third Bedroom on Garden Level"]
["km000367","SOLD","Family Residential",111,"Lynedock Crescent",539900,null,"Super Starter Home Steps to All Amenities, TTC & DVP/Highway 401","Completely Renovated from Top to Bottom!","YORK MILLS/FENSIDE"," 43°45'42.91\"N"," 79°19'46.60\"W",{"$f":"IF(ISBLANK(K309),\"\",DMS_to_Dec(K309))","v":43.761919444444445},-79.329611111111106,"http://www.karenmillar.com/spotlight_slideshow.php?id=km000367",null,null,null,"50 x 134.14 Feet","$3,326.44/2010","3+2","Four Car Parking ","2x4",null,null,"Immidiate/TBA","Fenside Public School","Donview Middle School","George S Henry Academy","Renovated from Top to Bottom","New Kitchen","New Windows Throughout","Large Private Lot","New Stainless Steel Kitchen Appliances","100 Amp Service","Central Air Conditioning"]
["km000368","SOLD","Family Residential",42,"Wallingford Road",849900,null,"Gorgeous Home with Out-of-this-World Back Yard","Backs on to Quiet Greenbelt! Don't Miss This Fabulous Opportunity!","BROOKBANKS/RAVINE"," 43°45'23.39\"N"," 79°19'30.20\"W",43.756497222222222,-79.325055555555551,"http://www.karenmillar.com/spotlight_slideshow.php?id=km000368",null,null,null,"73.25 x 170 Feet","$5,005.32/2010","2+2","Double Car Garage + 3 Car Parking","1x5, 1x4, 1x3",null,null,"90 Days/TBA","Ranchdale Public School","Donview Middle School","Victoria Park Collegiate Institute","Backs on to Greenbelt","Roof'03","Attic Insulation Upgraded to 7\"","Exterior Walls are R-18","Front & Back Additions","Windows are Low-E","100 Amp Service","Furnace'02","Central Air Conditioning '02","In-ground Vinyl Pool with Pump'08, Filter'06, Gas Heater'08, Liner, Coping & Skimmer'09","Supervised Hardwire Alarm System with Reliance Protectron Security Services ($42/month)"]
["km000369","SOLD","Family Residential",94,"Markham Street",799900,null,"Renovated 2 Storey with Fabulous Kitchen & Hardwood Flooring Throughout!","Spacious Home with Walk-out to Private Back Garden! Two Car Parking!","BATHURST/DUNDAS"," 43°38'59.70\"N"," 79°24'23.07\"W",43.64991666666667,-79.406408333333346,"http://www.karenmillar.com/spotlight_slideshow.php?id=km000369",null,null,null,"19.83 X 136 Feet","$3,917.03/2010",3,"Two Car Parking","2x4",null,null,"Aug 2011/TBA","Charles G. Fraser Junior Public School","Ryerson Collegiate Institute","Parkdale Collegiate Institute","New Hardwood Flooring Throughout Main & Upper Level","New Windows Throughout","New Kitchen","New Stainless Steel Kitchen Appliances’07","High Ceilings Throughout","Two Furnaces’06","New Air Conditioner for Upper Level","200 Amp Service","Updated Plumbing & Wiring"]
["km000370","SOLD","Family Residential",31,"Sagebrush Lane",829900,null,"Rare West Facing Wooded Ravine Lot on Quiet Cul-de-Sac!","Spacious Home with Grand Solarium!","BROOKBANKS/RAVINE"," 43°45'26.25\"N"," 79°19'54.89\"W",{"$f":"IF(ISBLANK(K312),\"\",DMS_to_Dec(K312))","v":43.757291666666667},-79.331913888888892,"http://www.karenmillar.com/spotlight_slideshow.php?id=km000370",null,null,null,"40x140 Feet Rear: 140 Feet(Ravine Lot)","$6,349.32/2010","5+1","Double Car Garage + 4 Car Parking","1x4, 1x3,1x2",null,null,"August 2011/or TBA","Ranchdale Public School","Donview Middle School","Victoria Park Collegiate Institute","West Facing Wooded Ravine Lot","Two Fireplaces","Main Floor Laundry Room","100 Amp Service","Air Conditioning (Heat Pump)","Located on Sought After Quiet Cul-de-Sac","Four Walk-outs on Main Floor & Four Walk-outs to Upper Level","Easy Access to DVP, Highway 401 & TTC"]
["km000371","SOLD","Family Residential",16,"Denver Crescent",749900,null,"Beautifully Renovated Open Concept Home On Quiet Cul-de-Sac!","Spacious Family Home Steps to School, Parks & TTC!","HENRY FARMS"," 43°46'19.25\"N"," 79°21'25.29\"W",43.772013888888885,-79.357024999999993,"http://www.karenmillar.com/spotlight_slideshow.php?id=km000371",null,null,null,"70.41 x 57.54 Rear 120 Feet","$4,152.93/2010","3+1","Double Car Garage + 4 Car Parking","1x4, 1x3, 1x2",null,null,"60/90 Days/TBA","Shaughnessy Public School","Shaughnessy Public School","George S Henry Academy","New Kitchen '07","New Stainless Steel Kitchen Appliances '07","New Lower Level '05 Re-Insulated & Re-Studded","New Doors & Windows","Open Concept","Surround Sound in Kitchen & Living Room","Surround Sound in Lower Level Recreation Room","New & Refinished Hardwood Flooring on Main Floor","Furnace '05","Roof '04","Central Air Conditioning","100 Amp Service","Three Updated Bathrooms","Great Covered Porch in Private Backyard","Located on Quiet Cul-de-Sac","Wired for Two Separate Phone Lines"]
["km000372","SOLD","Family Residential",183,"Roywood Drive",438888,null,"Super Spacious Detached Home in Don Mills!","Large Private Backyard! Steps to Schools, Parks, TTC, DVP & HWY 401!","YORK MILLS/DVP"," 43°45'54.50\"N"," 79°19'57.81\"W",43.765138888888892,-79.332724999999996,"http://www.karenmillar.com/spotlight_slideshow.php?id=km000372",null,null,null,"50 x 116 Feet","$3,169,70/2010",3,"Four Car Parking ","1x4, 1x3",null,null,"August 2011/or TBA","Fenside Public School","Donview Middle School","George S Henry Academy","Roof’08","Central Air Conditioner’11","Furnace’05","New Driveway’11","Private Fenced Backyard","Mostly New Windows’01"]
["km000373","SOLD","Family Residential",34,"Hirondelle Place",749900,null,"Located on Quiet Cul-de-Sac! Large Private Garden!","Beautifully Updated Home! Spacious & Gracious!","LAWRENCE/UNDERHILL"," 43°45'13.33\"N"," 79°19'32.65\"W",{"$f":"IF(ISBLANK(K315),\"\",DMS_to_Dec(K315))","v":43.753702777777775},-79.325736111111112,"http://www.karenmillar.com/spotlight_slideshow.php?id=km000373",null,null,null,"60 x 112.18 Feet","$4,289/2010","3+1","Single Car Garage + 4 Car Parking","1x4, 1x2",null,null,"October 2011/TBA","Ranchdale Public School","Milne Valley Middle School","Victoria Park Collegiate Institute","Central Air Conditioning’09","Furnace’07","Roof’96","100 Amp Service","New Widened Driveway & Retaining Wall’11","Large Private Back Garden","New Kitchen'07 with Stainless Steel Appliances","Express Bus to Downtown at the End of the Street"]
["km000374","SOLD","Family Residential",90,"Albertus Avenue",849900,null,"Detached North Toronto Home on Sought After Street!","Spacious & Renovated! A True Beauty!","YONGE/LAWRENCE"," 43°42'50.87\"N"," 79°24'9.61\"W",43.714130555555556,-79.402669444444456,"http://www.karenmillar.com/spotlight_slideshow.php?id=km000374",null,null,null,"25x134 Feet","$4,862.99/2010",3,"One Car Parking","1x4,2x3",null,null,"60-90 Days/TBA","John Ross Robertson Junior Public School","Glenview Senior Public School","Lawrence Park Collegiate Institute, North Toronto Collegiate Institute","100 Amp Service","Interior Renovated in 2008","Three New Bathrooms","Private Garden with Deck","Ductless Panasonic Air Conditioning","Stainless Steel Kitchen Appliances","Asko Ductless Washer/Dryer","Steps to Yonge Street Shopping"]
["km000375","SOLD","Condo",57,"Crab Appleway",309900,null,"Rare 4 Bedroom Corner Townhouse!","Spacious 2 Storey Townhouse with Walk-out to Greenbelt & Communal Pool!","LAWRENCE/VICTORIA PARK"," 43°44'42.11\"N"," 79°18'47.47\"W",43.745030555555559,-79.313186111111108,"http://www.karenmillar.com/spotlight_slideshow.php?id=km000375",null,null,null,null,"$1,964.46/2010","4+1","2 Car Parking","1x4, 1x3, 1x2","$315/mo (includes Cable +1, water, cable, common elements, building insurance, parking, landscaping and snow removal)",null,"Immediate/TBA","Cassandra Public School, Ranchdale Public School & Broadlands Public School (French Immersion)","Milne Valley Middle School","Victoria Park Collegiate Institute","New Furnace","Central Air Conditioning","100 Amp Service","End Unit","Four Bedrooms + One","Private Back Patio","Two Car Parking"]
["km000376","SOLD","Family Residential",45,"Morningside Avenue",319900,null,"Renovators Delight! Needs TLC!","Great Potential! Steps to schools, parks, & ttc!","MORNINGSIDE/FORDOVER"," 43°45'15.87\"N"," 79°10'50.78\"W",{"$f":"IF(ISBLANK(K318),\"\",DMS_to_Dec(K318))","v":43.75440833333333},-79.180772222222231,null,null,null,null,"43 x 117 Feet","$2,378.77/2011",3,"4 Car parking","1 x 4",null,null,"30 days/tba"]
["km000377","SOLD","Luxury",8,"Winsloe Avenue",1198000,null,"Large Private Lot in Sought After Leaside Neighbourhood!","Custom Built Spacious Home!","BAYVIEW/EGLINTON"," 43°42'49.19\"N"," 79°22'34.59\"W",43.713663888888888,-79.376274999999993,"http://www.karenmillar.com/spotlight_slideshow.php?id=km000377",null,null,null,"50 x 120 Feet","$7,286.95/2010","3+1","Single Car Garage + 2 Car Parking","1x4, 1x3, 1x2",null,null,"Sept. 2011/TBA","Northlea E & MS","Northlea E & MS","Leaside High School","200 Amp Service","Central Air Conditioning","Mostly Updated Windows","Large Private Lot"]
["km000378","SOLD","Condo",1101,"Leslie Street #203",479900,null,"Fabulous 1344 sq ft unit + 215 sq ft on a 32' Balcony","Gorgeous South & West Views of Sunnybrook Park & CN Tower!","LESLIE/EGLINTON"," 43°43'12.92\"N"," 79°20'56.00\"W",43.720255555555561,-79.348888888888879,"http://www.karenmillar.com/spotlight_slideshow.php?id=km000378",null,null,null,null,"$1616.29/2011","2+1","2 Car Parking","1 x 5, 1 x 3 Piece","$857.90/mo Includes heat, water, hydro, air conditioning, parking, building insurance & common elements",1,"August 22/2011","Rippleton Public School","Don Mills Middle School","Don Mills Collegiate Institute","Designer Kitchen","Hardwood flooring","Rare 2 Car Parking","Den Can be 3rd Bedroom","24 Hour Concierge","Access to Transportation in all directions","High Ceilings"]
["km000379","SOLD","Family Residential",26,"Hirondelle Place",669900,null,"Rare Large Lot in Don Mills on Quiet Cul-de-Sac!","Spacious Family Home with Many Updates!","LAWRENCE/UNDERHILL"," 43°45'13.43\"N"," 79°19'29.68\"W",{"$f":"IF(ISBLANK(K321),\"\",DMS_to_Dec(K321))","v":43.753730555555556},-79.324911111111106,"http://www.karenmillar.com/spotlight_slideshow.php?id=km000379",null,null,null,"38 x 88.23 Rear: 131.57 East\"140.92 Feet","$4,428.47/2011","3+1","Extra long single car garage + 2 car parking","1x4, 2x2",null,null,"Immediate/TBA","Ranchdale Public School","Milne Valley Middle School","Victoria Park Collegiate Institute","Mostly Updated Windows","New Kitchen Appliances","Updated Kitchen","Carrier Furnace’09","Central Air Conditioning","Central Vacuum","100 Amp Service","Large Private Lot","Refinished Hardwood Flooring Throughout Main Floor"]
["km000380","SOLD","Family Residential",49,"Ruden Crescent",889900,null,"Spacious Home on Large Private Lot!","Super Family Home in Sought After Neighbourhood!","DON MILLS/YORK MILLS"," 43°45'34.41\"N"," 79°20'37.90\"W",43.759558333333331,-79.34386111111111,"http://www.karenmillar.com/spotlight_slideshow.php?id=km000380",null,null,null,"65 x 113.02 Feet  South: 100 East: 71 Feet (per Survey)","$5,306.63/2011","3+2","Double Car Garage + 2 Car Parking","1x4, 2x3, 1x3 Spa",null,null,"Immediate/TBA","Rene Gordon Elementary School","Donview Middle School","George S Henry Academy","Large Private Lot","100 Amp Service","Roof Approximately 5-8 Years Old","Central Air Conditioning","Water Softener"]
["km000381","SOLD","Family Residential",15,"Fordover Drive",349900,null,"Renovator's Delight!","Steps to Lake Ontario, TTC, Schools & Parks!","GUILDWOOD/MORNINGSIDE"," 43°45'17.66\"N"," 79°10'47.21\"W",43.754905555555553,-79.179780555555567,null,null,null,null,"40.17 X 111 Feet","$2,571.05/2011",3,"Single Car Garage + 2 Car Parking","2x4",null,null,"30 Days/TBA","Poplar Road Junior Public School                                               ","Jack Miner Senior Public School","Sir Wilfred Laurier Collegiate Institute, Sir Robert L. Borden BTI"]
["km000382","SOLD","Family Residential",198,"Woodfield Road",330900,null,"Renovator's Delight!",null,"GREENWOOD/DUNDAS"," 43°40'10.02\"N"," 79°19'23.49\"W",{"$f":"IF(ISBLANK(K324),\"\",DMS_to_Dec(K324))","v":43.669449999999998},-79.323191666666659,null,null,null,null,"25 x 120 Feet","$2188.46/2011",1,null,"1x4, 1x2 Piece",null,null,"30 Days or TBA"]
["km000383","SOLD","Family Residential",63,"Roanoke Road",699900,null,"Stunning! Spectacular Extra Big Lot & Garden","New 4 Seasons Solarium with Cathedral Ceiling","LAWRENCE/UNDERHILL"," 43°44'33.19\"N"," 79°19'14.12\"W",43.742552777777782,-79.320588888888892,"http://www.karenmillar.com/spotlight_slideshow.php?id=km000383",null,null,null,"50 x 171 Feet ","$4392.79/2011",3,"Single Car Garage + 2 Car Parking","1 x 4, 1 x 2 Piece",null,null,"60 Days or TBA","Cassandra PS/Ranchdale PS","Milne Valley MS","Victoria Park CI","Solarium Addition '02","Large Private Lot with Betz Concrete In-ground Pool","Cadillac Shutters Throughout","100 amp service","2 gas Fireplaces","Furnace 96% Efficiency Rating '08","Roof 2007 with 25 year Shingles","2 Updated Bathrooms","New Thomasville Kitchen '07","Rough-ed in Central Vaccuum","Rinnai Tankless Hot Water System '08"]
["km000384","SOLD","Family Residential",156,"Three Valleys Drive",459900,null,"Beautiful Ravine Lot Overlooking Donalda Golf Course","Fabulous Neighbourhood!","YORK MILLS/DON MILLS"," 43°44'47.88\"N"," 79°20'11.91\"W",43.746633333333335,-79.336641666666665,"http://www.karenmillar.com/spotlight_slideshow.php?id=km000384",null,null,null,"Ravine Lot: 36 x 123 Feet","$3536.43/2011",3,"3 Car Parking","1 x 4 Piece",null,null,"October 25/2011 or TBA","Three Valleys Public School","Milne Valley Middle School","George S. Henry Academy","Roof 2004","Furnace 2004","Windows 2001","Central Air Conditioning 2007","Re-Finished Hardwood Flooring","Easy Access to DVP, TTC & 401","Kitchen Updated 2009","Bathroom Updated 2008"]
["km000385","SOLD","Family Residential",26,"Meadowglade Crescent",789000,null,"Exclusive Community with Sought After Jk- Grade 8 PS Just Down the Street","Rare Super Sized Home and Lot","HENRY FARMS"," 43°46'18.90\"N"," 79°20'57.51\"W",43.771916666666662,-79.349308333333326,"http://www.karenmillar.com/spotlight_slideshow.php?id=km000385",null,null,null,"49 x 161.14 Feet, Rear: 93.62, West 120.15","$5348.26/2011",4,"Double Car Garage + 4 Car Parking","1 x 4, 1 x 3, 1 x 2 Piece",null,null,"Immediate or TBA","Shaughnessy PS","Shaughnessy PS ","George S. Henry Academy","Original Owner Since 1964","Furnace 2007","Roof 2007","100 Amp Service )circuit breakers)","Hardwood Flooring Under Broadloom on Upper Level"]
["km000386","SOLD","Family Residential",152,"Homestead Road Unit 6",215500,null,"First Time Buyers Alert!","Great Opportunity for the Investor or Young Family To Get into the Market","LAWRENCE/HOMESTEAD"," 43°46'7.87\"N"," 79°10'48.27\"W",{"$f":"IF(ISBLANK(K328),\"\",DMS_to_Dec(K328))","v":43.768852777777774},{"$f":"IF(ISBLANK(L328),\"\",DMS_to_Dec(L328))","v":-79.180075000000002},"http://www.karenmillar.com/spotlight_slideshow.php?id=km000386",null,null,null,null,"$1516.47/2011",4,"Single Car Garage + 1 Car Parking","1 x 4, 1 x 2 Piece","$390/mo (includes water, building insurance & common elements)",null,"30/60 Days or TBA","Heron Park Junior PS","Joseph Brant Sr PD","Sir Wilfred Laurier CI","Well Maintained Townhome","Bright and Spacious","Fun-Filled Family Neighbourhood","Close to Schools, Transportation, Parks & Shops","Renovated Kitchen And Bathrooms","Lower Levels with Walk-out to Garden"]
["km000387","SOLD","Family Residential",6,"Minorca Place",1198000,null,"Ravine Lot Plus Cul-De-Sac!","This Sought After Neighbourhood's Proximity To Parks,Schools And The Donalda Golf Club, Has Become A Favourite For The Upscale Family","DON MILLS/YORK MILLS"," 43°45'8.96\"N"," 79°20'16.67\"W",{"$f":"IF(ISBLANK(K329),\"\",DMS_to_Dec(K329))","v":43.752488888888891},{"$f":"IF(ISBLANK(L329),\"\",DMS_to_Dec(L329))","v":-79.337963888888879},"http://www.karenmillar.com/spotlight_slideshow.php?id=km000387",null,null,null,"39.75 x 109.6 Feet, Irregular Rear 92.9 East Side 115.8","$5,911.24/2011","2 + 2","Double Car Garage + 4 Car Parking","1 x 5, 2 x 3 Piece",null,null,"120 Days or TBA","Three Valleys PS","Milne Valley MS","George S. Henry Academy","New Roof 2011","Main Floor Renovated '02 & '03","Mostly New Windows","House Updated by Kimberly Stewart Designs '11","Roof '99","Central Air Conditioning '98","Furnace '98","200 Amp Service","New Kitchen '08","All New Interior Doors '11","Finished Lower Level","Inground Rand Pool"]
["km000388","SOLD","Condo",36,"Charlotte Street, Unit 202",299900,null,"One of Toronto's Hottest Neighbourhoods!","Charlotte Lofts!","KING/SPADINA"," 43°38'47.85\"N"," 79°23'38.60\"W",{"$f":"IF(ISBLANK(K330),\"\",DMS_to_Dec(K330))","v":43.646625},-79.394055555555568,"http://www.karenmillar.com/spotlight_slideshow.php?id=km000388",null,null,null,null,"$1873.28/2011",1,null,"1 x 4 Piece","$342.25/mo (includes water, hydro, heat, central air conditioning, common elements & building insurance)",1,"Immdeiate or TBA",null,null,null,"Over 9' Ceilings","Floor-to-ceiling Windows","Granite countertop","Entertainment district"]
["km000389","SOLD","Family Residential",5,"Versend Drive",549900,null,"Super Spacious and Pristine Ranch Bungalow","Beautifully Maintained In & Out!","YORK MILLS/DVP"," 43°45'45.99\"N"," 79°19'45.63\"W",43.762774999999998,-79.329341666666664,"http://www.karenmillar.com/spotlight_slideshow.php?id=km000389",null,null,null,"50 x 106.96, Rear: 67', East 117.5","$3,653.38/2011","3 + 1","Oversized Single Car Garage + 4 Car Parking","1 x 4 , 1 x 2 Piece",null,null,"Nov 1/2011 or TBA","Fenside PS","Donview MS","George S. Henry","Newer Roof 2006","Mostly Updated Windows","Two Fireplaces","Quiet Street in Wonderful Family Neighbourhood","Close to Shops, Schools, Library and TTC"]
["km000390","SOLD","Family Residential",27,"Halkin Crescent",559900,null,"Totally Renovated Including Drywall, Electrical & Plumbing!","\"Like New\" Bungalow Nestled on a Quiet and Sought After Crescent","VICTORIA VILLAGE"," 43°43'43.68\"N"," 79°18'44.04\"W",43.7288,-79.312233333333324,"http://www.karenmillar.com/spotlight_slideshow.php?id=km000390",null,null,null,"56.50 x 107.50 Feet","$3,961.57/2011",3,"2 Car Parking","1 x 4, 1 x 2 Piece",null,null,"30-60 Days or TBA","Sloane PS","Milne Valley MS","Victoria Park CI","New plumbing","New electrical","Mostly new drywall","New kitchen","New central air conditioning","New Furnace","New roof","100 amp service","Original Owner","2 New Bathrooms","Windows replaced","New interior doors","New hardware"]
["km000391","SOLD","Family Residential",205,"Three Valleys Drive",489900,null,"Rare 4 Bedroom Semi in The Exclusive Donalda Golf Club Community","Large Lot Nestled on a Quiet, Family-Fun Cul-de-Sac ","DON MILLS/YORK MILLS"," 43°44'42.12\"N"," 79°20'12.43\"W",{"$f":"IF(ISBLANK(K333),\"\",DMS_to_Dec(K333))","v":43.745033333333332},-79.33678611111111,"http://www.karenmillar.com/spotlight_slideshow.php?id=km000391",null,null,null,"29.5 x 145 Feet, Irregular Pie 65 Ft at Rear Cul-de-Sac","$3,185.56/2011",4,"2 Car Parking","1 x 4, 1 x 2 Piece",null,null,"30-60 Days or TBA","Three Valleys PS","Milne Valley MS","George S. Henry","Large Lot","Living/Family Room Addition","Updated Kitchen and bathrooms","New Gas Fireplace"]
["km000392","SOLD","Family Residential",24,"Pretoria Avenue",689900,null,"Playter Estates! Exquisite Renovation","Perfect for Empty Nesters! Rare Design with 4 Walkouts!","BROADVIEW/DANFORTH"," 43°40'41.75\"N"," 79°21'28.08\"W",43.678263888888885,-79.357799999999997,"http://www.karenmillar.com/spotlight_slideshow.php?id=km000392",null,null,null,"15.92 x 66 Feet","$3,982.45/2011","2 + 1",null,"1 x 4, 1 x 2 Piece",null,null,"60-90 days or TBA","Jackman Avenue Jr PS  ","Earl Grey Sr PS ","Riverdale CI","Beautifully Renovated","New Hardwood Flooring","Roof '03","New Pot lights","Modern Kitchen","Furnace '01","2 Balconies","New Lower Level","New Copper Pipes to Road","New Patio and Decks","All New Windows"]
["km000393","SOLD","Family Residential",62,"Wallingford Road",698900,null,"This Charming Renovated Bungalow is on a Lovely Private Lot with an Entertaining Size Mutli Tier Deck Plus Built in Hot tub","Relax in the Comfort of the Finished Lower Level, Perfect for Family  Get-Togethers","YORK MILLS/BROOKBANKS"," 43°45'25.54\"N"," 79°19'36.78\"W",43.757094444444448,-79.326883333333328,"http://www.karenmillar.com/spotlight_slideshow.php?id=km000393",null,null,null,"62 x 110 Feet","$4,103.02/2010","3 + 1","3 Car Parking + Extra long single car garage"," 1 x 4, 1 x 3 Piece",null,null,"30-60 days or TBA","Ranchdale PS","Donview MS","Victoria Park CI","Roof '03","Furnace '05","Updated Central Air Conditioning",null,"Newer Windows","New California Shutters","2 Gas Fireplaces","Central Vacuum","Single Car Garage with Garden Room ","100 Amp Service","Lower Level Family Room Designed by Candice Olsen"]
["km000394","SOLD","Family Residential",14,"Flintridge Road",398500,null,"Opportunity Knocks!","Well Maintained Home in Amazing Location with Schools, Parks & TTC Just Steps Away","BIRCHMOUNT/LAWRENCE"," 43°44'37.98\"N"," 79°16'55.30\"W",{"$f":"IF(ISBLANK(K336),\"\",DMS_to_Dec(K336))","v":43.743883333333336},-79.28202777777777,"http://www.karenmillar.com/spotlight_slideshow.php?id=km000394",null,null,null," 40 x 128.87 Feet"," $2,509.60/2011"," 3 + 1"," 3 Car Parking"," 1 x 4, 1 x 3 Piece",null,null," Immediate or TBA","General Crerar PS  ","General Crerar PS  ","Winston Churchill CI  ","Furnace '01","Central Air Conditioning '01","Oil Tank '01","Updated 4 Piece and Kitchen"]
["km000395","SOLD","Family Residential",54,"Wallingford Road",779900,null,"Amazing Lot! Backs onto Greenspace Where Nature Abounds! Acces to Parks and Walking Trails Are Steps Away","This Charming Updated Bungalow Has Been Beautifully Maintained","YORK MILLS/BROOKBANKS"," 43°45'23.88\"N"," 79°19'34.87\"W",43.756633333333333,-79.326352777777771,"http://www.karenmillar.com/spotlight_slideshow.php?id=km000395",null,null,null," 52 x 212 Feet"," $5,290.77/2011"," 3 + 1"," 4 Car Parking"," 1 x 4, 1 x 2, 1 x 1 Piece",null,null," 30 Days or Tba","Ranchdale PS","Donview MS","Victoria Park CI","Roof '09","Central Air Conditioning '07","Updated Windows","2 Fireplaces","Inground Pool"]
["km000396","SOLD","Family Residential",30,"Cedarbank Crescent",699900,null,"Wonderfully Well Maintained Home on a Magnificent Lot","Build or Renovate Your Dream Home","DON MILLS/LAWRENCE"," 43°44'30.59\"N"," 79°20'17.40\"W",43.741830555555559,-79.338166666666666,"http://www.karenmillar.com/spotlight_slideshow.php?id=km000396",null,null,null,null," $4,061.74/2011",3," Carport + 2 Car Parking","1 x 4, 1 x 2 Piece",null,null,"Immediate or TBA","Greenland PS */ Norman Ingram PS  ","Don Mills MS ","Don Mills CI","Roof '10","Windows '08","Furnace '07","Central Air Conditioning '04","Hardwood Flooring","Overlooks Donalda Golf Course","Lower Level Walk-out"]
["km000397","SOLD","Family Residential",97,"Laurentide Drive",1198800,null,"Stunning Renovation On a Reverse Ravine Like Lot","Gorgeous Modern Kitchen Overlooking Family Room","YORK MILLS/DON MILLS"," 43°45'21.15\"N"," 79°20'17.37\"W",43.755875000000003,-79.338158333333325,"http://www.karenmillar.com/spotlight_slideshow.php?id=km000397",null,null,null,"80 x 149.37 Feet"," $6,577.29/2011"," 3 + 1 "," Double Car Garage + 4 Car Garage"," 1 x 4, 2 x 3 Piece",null,null,"120 Days or TBA","Three Valleys PS","Milne Valley MS","George S. Henry","Newly Renovated","Central Air Conditioning (2007)","All New Front Windows & Doors (2011) Including Shutters, Windows & Doors by Ridley","New Plantation Shutters Across Entire Front of House","Two Gas Fireplaces","New Central Vacuum","Front completed (2011)","Family Room Addition (2006)","Inground Pool (New Gas Heater Within the Last Five years)","Reverse Ravine-like Back Garden","Lower Level Renovated (2003)","Furnace (1999)"]
["km000398","ARCHIVE","Family Residential",12,"Addison Crescent",699900,null,"What a charmer! And on a Sought After Crescent!","Steps to Bond Park, Don Mills Library and The Shops at Don Mills","LAWRENCE/DON MILLS"," 43°44'36.21\"N"," 79°21'4.00\"W",{"$f":"IF(ISBLANK(K340),\"\",DMS_to_Dec(K340))","v":43.743391666666668},-79.351111111111109,"http://www.karenmillar.com/spotlight_slideshow.php?id=km000398",null,null,null,"55 x 110 Feet"," $4158.88/2011",3,"Carport + 2 Car Parking"," 1 x 4, 1 x 2 Piece",null,null,"90 Days or TBA","Greenland PS/Norman Ingram PS","Don Mills Middle School","Don Mills C I"]
["km000399","SOLD","Family Residential",87,"Dutch Myrtle Way",529900,null,"Executive Contemporary Townhouse","1800 Square Feet of Open & Sun-Flooded Space","DON MILLS/LAWRENCE"," 43°44'23.42\"N"," 79°20'34.54\"W",43.73983888888889,-79.342927777777774,"http://www.karenmillar.com/spotlight_slideshow.php?id=km000399",null,null,null,null," $2755.41/2011",3," Single Car Garage + Single Car Parking"," 2 x 4, 1 x 3, 1 x 2 Piece"," $460.00/mo (includes water, building insurance, common elements & parking)",null," 90 Days or Tba"," Greenland Public School, Norman Ingram Public School"," Don Mills Middle School"," Don Mills Collegiate Institute"," Steps to Schools, Parks, The Shops at Don Mills, Donalda Golf & Country Club, & Transportation"," Second Floor Family Room"," California Style Blinds Thorughout"," Central Vacuum"," Central Air Conditioning"," 100 Amp Service"," Newer Broadloom"]
["km000400","SOLD","Family Residential",22,"Sargent Lane",609900,null,"Upper Beach Neighbourhood","Exclusive End Unit Townhome One Year New!","MAIN/GERRARD"," 43°41'6.38\"N"," 79°17'48.39\"W",43.685105555555552,-79.296774999999997,"http://www.karenmillar.com/spotlight_slideshow.php?id=km000400",null,null,null,null," $3816.61/2011"," 3+1"," Single Car Garage + 1 Car Parking","2 x 4, 1 x 2 Piece"," $318.45/mo (includes Parking, building insurance and common elements)",null,null,"Kimberley Jr PS","Glen Ames Sr PS","Malvern Collegiate Institute, Danforth C&TI, Monarch Park Collegiate Institute","9’ Ceilings Throughout Main Level","Engineered Hardwood Flooring","Stainless Steel Kitchen Appliances","Four Piece Master Ensuite Bathroom","Tankless Instant Hot Water System","Central Air Conditioning","Silhouette Blinds","Tarion New Home Warranty","Steps to Parks, Shops, Go Train & Transit"]
["km000401","SOLD","Family Residential",72,"Norden Crescent",729900,null,"Super Brick Bungalow With Extra Large Single Car Garage"," On A Sought After Crescent In A Wonderful Family Neighbourhood","DON MILLS/LAWRENCE"," 43°44'16.74\"N"," 79°21'5.38\"W",{"$f":"IF(ISBLANK(K343),\"\",DMS_to_Dec(K343))","v":43.737983333333332},-79.351494444444441,"http://www.karenmillar.com/spotlight_slideshow.php?id=km000401",null,null,null," 60 x 100 Feet"," $4309.53/2011",3," Extra Large Single Car Garage + 2 Car Parking"," 1 x 4, 1 x 2 Piece",null,null,"60 Days or Tba","Greenland Public School, Norman Ingram Public School","Don Mills Middle School","Don Mills Collegiate Institute","100 Amp Circuit Breakers '08","High Efficiency Furnace '04","Central Air Conditioning '05","Hot Water Tank Owned '08","Roof '11","Newer Windows on Upper Level","Family Room Addition '68"]
["km000402","SOLD","Condo",20,"Bloorview Place, Suite 516",435000,null,"Fabulous Unit With Over 910 Sf Plus 170Sf Balcony","Stunning Engineered Flooring","SHEPPARD/LESLIE"," 43°46'26.35\"N"," 79°21'30.84\"W",43.773986111111107,-79.358566666666661,"http://www.karenmillar.com/spotlight_slideshow.php?id=km000402",null,null,null,null," $1803.33/2011",2," 1 Car Parking (close to elevator)"," 1 x 4, 1 x 3 Piece"," $453.44/mo (includes heat, hydro, building insurance and common elements)",1," January 18, 2012 or TBA"," Dallington P.S"," Woodbine JHS"," George Vanier SS","170 sq ft Balcony with North East Views","Engineered Flooring","Approximately 910 Sq. Ft Suite","24 Hour Concierge","Super Amenities include Golf Simulator, Pool, Hot tub, Gym, Sauna, Multimedia Room and 2 Party Rooms"]
["km000403","SOLD","Family Residential",60,"Fulton Avenue",669300,null,"Great Potential! First Time Home Buyer or Investor!",null,"JACKMAN/FULTON"," 43°40'56.76\"N"," 79°21'17.55\"W",43.682433333333329,-79.354874999999993,null,null,null,null," 18.67 x 96 Feet"," $4,242.13/2011"," 3 + 1"," 0 Car Parking"," 2 x 4, 1 x 3 Piece",null,null,"30 Days or TBA"]
["km000404","SOLD","Family Residential",40,"Homewood Avenue #1404",229900,null,"Great Potential! First Time Home Buyer or Investor!",null,"JARVIS/CARLTON"," 43°39'50.95\"N"," 79°22'30.72\"W",43.66415277777778,-79.375199999999992,null,null,null,null,null," $1,528.35/2011",1," 1 Underground Parking Spot"," 1 x 4 Piece","$503.96/mo (includes water, heat, hydro, common elements and building insurance)","Exclusive","30 Days or TBA"]
["km000405","SOLD","Family Residential",161,"Three Valleys Drive",529900,null,"Amazing Ravine Property on Cul-de-sac!","Steps to Donalda Golf Course!","YORK MILLS/LAURENTIDE"," 43°44'45.22\"N"," 79°20'9.79\"W",{"$f":"IF(ISBLANK(K347),\"\",DMS_to_Dec(K347))","v":43.745894444444446},-79.336052777777766,"http://www.karenmillar.com/spotlight_slideshow.php?id=km000405",null,null,null," 50 x 121 Ravine/Cul-de-sac"," $3,603.83/2011",4,"3 Car Parking"," 1 x 4 Piece",null,null,"Immediate or TBA","Three Valleys PS","Milne Valley MS","George S. Henry","New Roof 2011","New Kitchen 2009","Hardwood Flooring","Inground Plunge Pool with New Steel Fence"]
["km000406","SOLD","Family Residential",114,"Roywood Drive",449900,null,"Backs and Sides on to Fenside Park!","Amazaing Location in a Fabulous Family Neighbourhood","YORK MILLS/DVP"," 43°45'57.62\"N"," 79°19'40.63\"W",43.766005555555559,-79.327952777777767,"http://www.karenmillar.com/spotlight_slideshow.php?id=km000406",null,null,null," 30 x 120 Feet"," $2,537.35/2011",4," Carport + 3 Car Parking"," 1 x 4, 1 x 2 Piece",null,null,"30 Days or TBA","Fenside PS","Donview MS","George S. Henry","Original Owner","Updated Windows","Air Conditioning '06","100 Amp Service","Close to Schools, Library, TTC & DVP"]
["km000407","SOLD","Family Residential",65,"Wallingford Road",629900,null,"Well maintained and cared for bungalow","Steps to conservation park, schools, shops, DVP and 401 plus an express bus to downtown","BROOKBANKS"," 43°45'26.95\"N"," 79°19'36.60\"W",43.757486111111113,-79.326833333333326,"http://www.karenmillar.com/spotlight_slideshow.php?id=km000407",null,null,null," 60 X 110 Feet"," $4216.36/2011"," 3 + 2"," Extra long garage + 2 car parking"," 1 x 4, 1 x 3 Piece",null,null,"30 - 60 Days or Tba"," Ranchdale PS"," Donview MS"," Victoria Park CI"," Furnace '06","Updated windows","100 Amp Circuit Breakers","Kitchen and Lower Level Workshop Addition","Lower Level Walk-up"]
["km000408","SOLD","Family Residential",35,"Tinder Crescent",529900,null,"This is a gem! Beautifully updated!","Come Enjoy and Relax!","SLOANE/EGLINTON"," 43°43'36.38\"N"," 79°18'35.52\"W",{"$f":"IF(ISBLANK(K350),\"\",DMS_to_Dec(K350))","v":43.726772222222223},-79.309866666666665,"http://www.karenmillar.com/spotlight_slideshow.php?id=km000408",null,null,null," 50 x 120 Feet"," $3,738.63/2011"," 3 + 3"," Single Car Garage + 4 Car Parking"," 1 x 4, 1 x 3 PIece",null,null,"May/June 2012 or Tba","Sloane PS","Milne Valley MS","Victoria Park CI","Roof 2007","Hi Effeciency Hot Water Gas Furnace","Updated Windows","Tank-less Water Heater 2009","Aluminum Soffits and Fascia"]
["km000409","SOLD","Family Residential",59,"Laurie Shepway",399900,null,"End Unit & Backs Onto Detached Homes!","Tucked In A Crescent This Multi Level Executive Townhome Is A Diamond In The Rough","SHEPPARD/LESLIE"," 43°46'26.34\"N"," 79°21'42.40\"W",43.773983333333334,-79.361777777777775,"http://www.karenmillar.com/spotlight_slideshow.php?id=km000409",null,null,null,null," $2,735.58/2011",3," Built-in single car garage + 1 Car Parking"," 1 x 4, 1 x 2 PIece"," $502.89/mo (includes cable, water, parking, common elements and building insurance)",null," Immediate or TBA","Dallington P.S","Woodbine JHS","Georges Vanier S.S.","End Unit","Central Air Conditioning","12 Ft Ceilings in Living Room","Subway, GO train and DVP/401"]
["km000410","SOLD","Family Residential",109,"Three Valleys Drive",829900,null,"Wonderful family home on an amazing lot","Beautifully Maintained in the Sought After Donalda Club Neighbourhood","YORK MILLS/DON MILLS"," 43°44'53.99\"N"," 79°20'15.76\"W",43.748330555555555,-79.337711111111105,"http://www.karenmillar.com/spotlight_slideshow.php?id=km000410",null,null,null," 85 x 100 ft. Irregular"," $5,088.57/2011"," 3  + 1"," Single car garage + 4 car parking"," 1 x 4, 1 x 3 Piece",null,null," 90-120 Days or TBA"," Three Valleys PS"," Milne Valley MS"," Victoria Park CI"," Hi Effeciency Furnace"," Central Air Conditioning '06"," 100 Amp Circuit Breakers"," Beautiful Corner Lot"," In-Ground Pool"]
["km000411","SOLD","Family Residential",55,"Valentine Drive",1080000,null,"Sun-flooded, Stunning and Spacious Donalda Club Residence!","Quality Finishes Used to Make This Outstanding Family Home","YORK MILLS/DON MILLS"," 43°45'40.57\"N"," 79°20'31.17\"W",43.761269444444444,-79.341991666666658,"http://www.karenmillar.com/spotlight_slideshow.php?id=km000411",null,null,null,"52 x 118.5 Feet"," $5,403.77/2011"," 3 + 1","Double Car Garage + 2 Car Parking"," 1 x 5, 1 x 4, 1 x 3 Piece",null,null,"June 2012 or TBA","Rene Gordon ES or Broadlands PS (french immersion)","Donview MS","George S Henry Acedemy",null,"• Most Exterior Walls Insulated R12 (Basement, Main Floor and Header) 2010/11",null,null,"• Bathrooms 2010/11"]
["km000412","SOLD","Family Residential",19,"Anewen Drive",879900,null,"Exquisite Home On One of The Best Ravine Properties Because Of The Amount Of Tableland As Well As Magnificent Vistas Of The Ravine",null,"VICTORIA VILLAGE"," 43°44'1.09\"N"," 79°19'0.92\"W",43.73363611111111,-79.316922222222217,"http://www.karenmillar.com/spotlight_slideshow.php?id=km000412",null,null,null," 60.01 x 136 Feet"," $4481.99/2011"," 3 + 1","Double Car Garage + 4 Car Parking"," 1 x 5, 2 x 3 Piece",null,null,"June 2012 or TBA","Victoria Village Public School","Milne Valley MS","Victoria Park CI","Eco Energy Audit 2010/11","Most Exterior Walls Insulated R12 (Basement, Main Floor and Header) 2010/11","Deluxe CPVC Low E Argon Filled Windows/Doors 2010/11","Attic Insulation (Min 18”)","Bathrooms 2010/11","Kitchen with Granite Counters and Breakfast Bar 2010","Select Maple Hardwood Flooring with Additional Subfloor Added 2011","Wooden Deck with Glass Insert Handrail 2011","Kitchen Appliances 2010","Roof  - Architectural shingles 2011","Furnace 2007","Central Air Conditioning","100 Amp Service","Mostly New Wiring and Plumbing 2010/11"]
["km000413","SOLD","Family Residential",65,"Laurentide Drive",1198000,null,"Rare 4 Bedroom Ranch Bungalow on a Magnificent 85ft Lot in the Prestigious and Demand Donalda Golf Course Neighbourhood",null,"YORK MILLS/SILVERDALE"," 43°45'13.98\"N"," 79°20'26.56\"W",43.753883333333334,-79.340711111111105,"http://www.karenmillar.com/spotlight_slideshow.php?id=km000413",null,null,null," 85.25 x 123.75"," $6,155.06/2011"," 4 + 1"," Double Car Garage + 4 Car Parking"," 2 x 5, 1 x 2 Piece",null,null,"90-120 Days or TBA","Three Valleys PS","Milne Valley MS","George S Henry CI","Hi Effeciency Gas Furnace 2009","100 Amp Circuit Breakers","Central Air Conditioning","Updated Thermopane Windows","5 Skylights"]
["km000414","SOLD","Family Residential",15,"Groveland Crescent",599900,null,"Prestigious Donalda Golf Course Neighbourhood!","Steps to Schools, Parks, TTC and DVP/401","YORK MILLS/DON MILLS"," 43°45'1.94\"N"," 79°20'4.40\"W",{"$f":"IF(ISBLANK(K356),\"\",DMS_to_Dec(K356))","v":43.75053888888889},-79.334555555555553,"http://www.karenmillar.com/spotlight_slideshow.php?id=km000414",null,null,null,"65 x 110 Feet"," $4,139.05/2011"," 2 + 2"," Carport + 2 Car Parking"," 1 x 4, 1 x 3 Piece",null,null," 30 Days or Tba","Three Valleys PS","Milne Valley MS","George S Henry CI","Lower Level Nanny Suite Potential"]
["km000415","SOLD","Condo",170,"Roehampton Avenue, 602",270900,null,"Super Opportunity!",null,"MOUNT PLEASANT/EGLINTON"," 43°42'32.95\"N"," 79°23'37.11\"W",43.709152777777781,-79.393641666666667,null,null,null,null,null,0,2,"1 Underground parking space"," 1 x 4 Piece"," $786.47/mo (inlcudes taxes, heat, cable, water, parking, common elements and building insurance)","1 Exclusive locker","30 days or TBA"]
["km000416","SOLD","Family Residential",79,"Kingslake Road",659900,null,"Fabulous Family Home!","Immaculate! Original Builder's Model Home","DON MILLS/SOUTH of FINCH"," 43°47'3.94\"N"," 79°20'37.16\"W",43.784427777777779,-79.343655555555557,"http://www.karenmillar.com/spotlight_slideshow.php?id=km000416",null,null,null,"55 x 110 Feet"," $3,891.26/2011"," 4 + 1"," Single Car Garage + 2 Car Parking"," 1 x 4, 1 x 2 Piece",null,null," May 11, 2012 or TBA","Kingslake PS  ","Woodbine JHS","George Vanier","Furnace 2010","Roof 2009","Hardwood Under Broadloom on Main and Upper Level"]
["km000417","SOLD","Family Residential",3,"Trophy Drive",689900,null,"Stunning Home In One Of The Best North York Family Neighbourhoods: Victoria Village","This is the Perfect Home for Families","VICTORIA VILLAGE"," 43°43'39.69\"N"," 79°18'48.63\"W",{"$f":"IF(ISBLANK(K359),\"\",DMS_to_Dec(K359))","v":43.727691666666665},-79.313508333333331,"http://www.karenmillar.com/spotlight_slideshow.php?id=km000417",null,null,null,"70 x 164.2 Feet"," $3,720.79/2011"," 3 + 1 "," Single Car Garage + 4 Car Parking"," 1 x 4, 1 x 3 Piece",null,null,"90 Days or TBA","Victoria Village Public School","Milne Valley MS","Victoria Park CI","Brada Windows 2008","Roof 2008","100 Amp Service","Central Air Conditioning","4 Piece Bathroom 2007","2 Kitchens","Side Entrance","Lower Level 2002"]
["km000418","SOLD","Family Residential",5,"Parmbelle Crescent",1198000,null,"Donalda Golf Club Ranch Bungalow on a Fabulous Lot","Amazing Location for Your Own Family Home","YORK MILLS/PARMBELLE"," 43°45'9.57\"N"," 79°20'25.06\"W",43.752658333333336,-79.340294444444439,"http://www.karenmillar.com/spotlight_slideshow.php?id=km000418",null,null,null,"85 x 117 (rear 100 on a corner frontage could be 100')","$5950.88/2011"," 3 + 3"," Double Car Garage + 6 Car Parking"," 2 x 4, 1 x 2 Piece",null,null,"Sept/Oct 2012","Three Valleys PS","Milne Valley MS","George S Henry CI","Roof 2008","Front and Back Landscaping 2011","Schools, parks, ravines, golf, ttc, dvp and 401 all just steps away"]
["km000419","SOLD","Condo",906,"Sheppard Avenue West, 215",289900,null,"Super location, building complex and condo!","Amazing Location with Shops (Yorkdale),  Restaurants, and Transportation Including Subway and Bus to York University Right at Your Door Step","SHEPPARD/WILSON HTS"," 43°45'7.46\"N"," 79°27'25.16\"W",43.752072222222225,-79.456988888888887,"http://www.karenmillar.com/spotlight_slideshow.php?id=km000419",null,null,null,null," $1,526.38/2011",2," 1 Underground Parking Spot"," 1 x 4 Piece"," $323.65/mo (includes water, parking, common elements and building insurance)",1," June 25/2012 or TBA"," Dublin Heights Elementary"," Dublin Heights Middle School"," William L Mackenzie CI"," New 4 Piece Bathroom"," New Kitchen Appliances"," New Engineered Hardwood Flooring"," Close to shops, restaurants, schools, transportation and York University bus"," Stacked washer and dryer"," Rooftop terrace"]
["km000420","SOLD","Family Residential",117,"Plateau Crescent",799900,null,"A wow! Over 2300 sq ft on Main Level","Open, sun-flooded and spacious family home in Don Mills most sought after neighbourhoods","LAWRENCE/DON MILLS"," 43°44'2.96\"N"," 79°20'9.50\"W",{"$f":"IF(ISBLANK(K362),\"\",DMS_to_Dec(K362))","v":43.734155555555553},-79.335972222222225,"http://www.karenmillar.com/spotlight_slideshow.php?id=km000420",null,null,null," 63 x 105 Feet"," $4,384.86/2011"," 4 + 1","3 Car Parking"," 3 x 4 Piece",null,null,"June 2012 or TBA","Greenland PS/Norman Ingram PS","Don Mills MS ","Don Mills CI","Furnace 2008","Cenral Air Conditioning 2011","New Lower Level","2 New 4 Piece Bathrooms","Main Floor Laundry Room","New Kitchen","Energy Audited","100 Amp Service","Corner Lot","Open Concept","Wired for Alarm System","Professionally Designed Interior"]
["km000421","SOLD","Family Residential",7,"Brookwood Court",799900,null,"Gorgeous! Totally Updated, this home just shines","Location, Location, Location!","LESLIE/LAWRENCE"," 43°43'46.62\"N"," 79°21'9.95\"W",43.729616666666665,-79.352763888888887,"http://www.karenmillar.com/spotlight_slideshow.php?id=km000421",null,null,null," 50 x 118 Feet"," $4,043.90/2011"," 3 + 2"," Single car garage + 3 car parking"," 2 x 4 Piece",null,null,"120 Days or TBA","Greenland PS/Norman Ingram PS","Don Mills MS ","Don Mills CI","New roof 2005","Furnace 2003","Windows 2005","Super Lovely Lower Level with 2 Bedrooms & Kitchen","Wireless Home Alarm System","100 Amp Service","Amazing Edwards Gardens with Walking and Bike Trails"]
["km000422","SOLD","Condo",18,"Valley Woods Road, #609",249900,null,"Stunning 1 Bedroom + Den in the Beautiful Award Winning \"Bellair Garden\"","Steps to TTC, 401/DVP, shops, ravines, parks and library","YORK MILLS/DVP"," 43°45'8.73\"N"," 79°19'58.64\"W",43.752425000000002,-79.332955555555557,null,null,null,null,null," $1,613.60/2011"," 1 + 1 "," 1 Underground Parking Spot"," 1 x 4 Piece"," $435.19/mo (includes water, parking, heat, common elements and building insurance)",1," 90 days or TBA"," Three Valleys PS"," Milne Valley MS"," George S Henry Acedemy","Updated kitchen","Granite Countertop","High quality hardwood flooring","South-East views from Balcony"]
["km000423","SOLD","Family Residential",41,"Wallingford Road",699900,null,"Stunning! Move-in Perfect!","Super Location with Schools, Shops and Ravine Parks and Walking Trails","BROOKBANKS"," 43°45'24.24\"N"," 79°19'27.75\"W",43.756733333333337,-79.324374999999989,"http://www.karenmillar.com/spotlight_slideshow.php?id=km000423",null,null,null," 56 x 115 Feet"," $4,067.69/2011",3," Detached Single Car Garage + 4 Car Parking"," 2 x 4 Piece",null,null," 30-60 Days or TBA","Ranchdale Public School","Donview Middle School","Victoria Park Collegiate Institute","Lower Level 2011","Furnace 2007","100 Amp Circuit Breakers 2006","Roof 2008","Garage 2006-07","Kitchen Cabinets 2011","Deck and Fence 2011","Casement Windows 2008","Central Air Conditioning"]
["km000424","SOLD","Condo",205,"The Donway West, 205",299900,null,"Location, Location, Location!","South Facing and Right Across from the \"Shops at Don Mills\"","LAWRENCE/DON MILLS"," 43°44'14.84\"N"," 79°20'48.18\"W",43.737455555555556,-79.346716666666666,null,null,null,null,null," $1,690.91/2011"," 1 + 1"," 1 Underground Spot (B17)"," 1 x 4 Piece"," $447.63/mo (includes water, heat, parking, common elements & building insurance)","1 (B234)","May 16, 2012 or TBA",null,null,null,"Amenites: Concierge, Exercise Room, Indoor pool, Recreation Room, Rooftop Deck/Garden & Sauna","Upgrades Finishes","Granite countertop"," New Broadloom"]
["km000425","SOLD","Family Residential",53,"Deloraine Avenue",989900,null,"Wonderful North Toronto Home in Sought After John Wanless School District","Upgraded & Well Maintained Rare 4 Bedroom","YONGE/JOICEY"," 43°43'59.93\"N"," 79°24'24.75\"W",{"$f":"IF(ISBLANK(K367),\"\",DMS_to_Dec(K367))","v":43.733313888888894},-79.406874999999999,"http://www.karenmillar.com/spotlight_slideshow.php?id=km000425",null,null,null," 25 x 150 Feet"," $5,542.52/2011"," 4 + 1 "," Double car parking + mutual drive"," 1 x 4, 1 x 3 Piece",null,null,"June 2012 or tba","John Wanless Public School","Glenview Sr Public School","Lawrence Park CI","Amazing Lot - 150 Ft Depth","Hot Water Gas Furnace","Quarter Cut Oak Hardwood Flooring","Renovated Lower Level with Great Ceiling Height","Four Bedrooms on One Floor","5-Star Location","Steps to Yonge, Transportation, Schools & Parks"]
["km000426","SOLD","Family Residential",27,"Sweeney Drive",639900,null,"Lovely Updated Family Home!","Fabulous & Finished Lower Level","VICTORIA VILLAGE"," 43°44'10.58\"N"," 79°18'35.82\"W",43.736272222222226,-79.309950000000001,"http://www.karenmillar.com/spotlight_slideshow.php?id=km000426",null,null,null," 50 x 120 Feet"," $3,645.46/2011"," 3 + 2"," Single Car Garage + 2 Car Parking"," 1 x 4, 1 x 3 Piece",null,null,"60 Days or TBA","Victoria Village Public School","Milne Valley MS","Victoria Park CI"," Furnace 2008"," Central Air Conditioning"," Central Vacuum"," Steps to Woodbine and Victoria Park Bus"," Updated Windows"," Large Sliding Door Walkout to Entertainment Sized Deck"]
["km000427","SOLD","Family Residential",63,"Hemford Crescent",749900,null,"Close Proximity to Transportation, Schools, Library Shops at Don Mills and Parks","Charming Bungalow with Spacious Family/Living Room Overlooking Backyard","DON MILLS/LAWRENCE"," 43°44'31.49\"N"," 79°21'6.65\"W",43.742080555555553,-79.351847222222219,"http://www.karenmillar.com/spotlight_slideshow.php?id=km000427",null,null,null,"55 x 110 Feet"," $4,415.00/2011"," 3 + 1"," 3 Car Parking"," 2 x 3 Piece",null,null,"60-90 Days or TBA","Greenland PS/Norman Ingram PS","Don Mills MS ","Don Mills CI","Roof 2005","Furnace 2006","Central Air Conditioning 2006","Pella Windows in Upper Level 2010","Lower Level Windows 2011"]
["km000428","SOLD","Duplex","45A/45","Heath Street E",1575000,null,null,null,"ST.CLAIR/YONGE"," 43°41'25.55\"N"," 79°23'33.99\"W",{"$f":"IF(ISBLANK(K370),\"\",DMS_to_Dec(K370))","v":43.690430555555551},-79.392775,null,null,null,null,"42 x 132 Feet"," $12,821.55/2011",8," 2 Built-in Garages + 4 Car Parking"," 4 x 4, 2 x 2 Piece",null,null,"30 Days or TBA"]
["km000429","SOLD","Family Residential",104,"Laurentide Drive",1298800,null,"Beautifully Re-Finished Hardwood Flooring & Freshly Painted","Spacious Ranch Bungalow with Walk-out Lower Level","YORK MILLS/DON MILLS"," 43°45'19.85\"N"," 79°20'15.04\"W",43.755513888888892,-79.337511111111112,"http://www.karenmillar.com/spotlight_slideshow.php?id=km000429",null,null,null," 76 x 145 feet (rear 135 ft, East side 137ft)"," $6,654.60/2011"," 3 + 2 ","Double Car Garage + 4 Car Parking"," 1 x 4, 1 x 3 Piece",null,null,"60-90 days or TBA","Three Valleys PS","Milne Valley MS","George S Henry Academy","Amazing Lot!","Backing and Siding on to a Very Private Parkette","Steps to Donalda Golf Club, Transportation, 401/DVP"]
["km000430","SOLD","Family Residential",77,"Albertus Avenue",799900,null,"Gorgeous and Totally Renovated!","Single Car Garage + 2 Car Parking!!","LYTTON/DUPLEX"," 43°42'50.14\"N"," 79°24'8.34\"W",43.713927777777783,-79.402316666666678,"http://www.karenmillar.com/spotlight_slideshow.php?id=km000430",null,null,null," 21 x 133.75 Feet"," $4,961.26/2012"," 3 + 1"," Single Car Garage + 2 Car Parking (mutual driveway)"," 1 x 4, 1 x 3 Piece",null,null," 60-90 Days or TBA","John Ross Robertson Junior Public School","Glenview Senior Public School","Lawrence Park Collegiate Institute, North Toronto Collegiate Institute","100 Amp Service","Stainless Steel Kitchen Appliances","Steps to Yonge Street Shopping","Roof 2009 and 2011","Furnace 2007","Central Air Conditioning","Newer Windows","Annual Street Part in June","New Party Wall in Attic"]
["km000431","SOLD","Condo",10,"Muirhead Road, 106",239900,null,"Incredible Location Close to Dvp/401, TTC, Shops and Parks!","Great Layout with Super Size Modern Kitchen","SHEPPARD/404"," 43°46'42.72\"N"," 79°20'16.77\"W",{"$f":"IF(ISBLANK(K373),\"\",DMS_to_Dec(K373))","v":43.778533333333336},-79.337991666666667,"http://www.karenmillar.com/spotlight_slideshow.php?id=km000431",null,null,null,null," $1,349.95/2011",2," 1 Underground Parking Spot"," 1 x 4 Piece","561.52/mo (includes water, hydro, central air conditioning, parking, heat, cable, building insurance and common elements)",null,"Immediate or TBA","Muirhead Public School","Pleasant View Junior High School","Sir John A Macdonald CI","Super Recreation Facility","Gatehouse Security","Walkout to Garden Terrace"]
["km000432","SOLD","Family Residential",225,"Bicknell Avenue",357500,null,null,null,"EGLINTON/KEELE"," 43°41'17.27\"N"," 79°28'35.15\"W",43.688130555555553,-79.476430555555552,null,null,null,null,"34.25 x 115 Feet"," $2,253.88/2011"," 2 + 1","Single Car Garage + 1 Car Parking"," 2 x 4 Piece",null,null,"30 days or TBA"]
["km000433","SOLD","Family Residential",615,"Craven Road",320000,null,null,null,"COXWELL/GERRARD"," 43°40'28.11\"N"," 79°19'19.44\"W",43.674475000000001,-79.322066666666657,null,null,null,null," 20 x 70 Feet"," $1,843.53/2011",1,null," 1 x 4 Piece",null,null,"30 days or Tba"]
["km000434","SOLD","Family Residential",7,"Preakness Drive",839900,null,"Stunning Freehold \"Better Homes And Gardens\" Executive Townhouse","Private Entrance To An Exquisite Main floor With Hardwood Floors And 9Ft Ceilings","LESLIE/LAWRENCE"," 43°44'42.12\"N"," 79°21'18.80\"W",{"$f":"IF(ISBLANK(K376),\"\",DMS_to_Dec(K376))","v":43.745033333333332},-79.35522222222221,"http://www.karenmillar.com/spotlight_slideshow.php?id=km000434",null,null,null,null," $4,476.05/2011",3,"Private Underground Double Car Garage"," 1 x 5, 2 x 3 & 1 x 2 Piece"," $200/mo (includes water, snow removal & maintenance of underground garage)",null," 90-120 Days or Tba"," Rippleton PS","St. Andrews JHS  or Windfields JHS (fr. Immersion)","York Mills CI","9\" Ft Ceilings","Hardwood Flooring on Main Floor","California Shutters","Sun Deck","Sliding Door Walkout to Backyard from Family Room","Open Concept on Main Floor","Private Backyard","Stainless Steel Countertop","Island with Calacatta White Marble Counter Top"]
["km000435","SOLD","Family Residential",53,"Valentine Drive",5,null,"Spacious Executive Ranch Bungalow with Stunning Sunset Views","Rare 4 Bedroom Home in Sought After Donalda Neighbourhood","YORK MILLS/DON MILLS"," 43°45'41.04\"N"," 79°20'31.31\"W",43.761400000000002,-79.342030555555553,"http://www.karenmillar.com/spotlight_slideshow.php?id=km000435",null,null,null," 50 x 119.58 ft"," $4,269.68/2011",4," Double car garage + 4 car parking"," 1 x 4, 1 x 2 Piece",null,null," 30-60 days or tba","Rene Gordon ES or Broadlands PS (french immersion)","Donview MS","George S Henry Academy","Roof 2011","Newer Windows","Professionally Re-Finished Hardwood Flooring","Central Air Conditioning"]
["km000436","SOLD","Family Residential",57,"Painswick Crescent",468800,null,null,null,"SHEPPARD/BRIAN"," 43°46'50.10\"N"," 79°19'42.35\"W",43.780583333333333,-79.328430555555556,"http://www.karenmillar.com/spotlight_slideshow.php?id=km000436",null,null,null,"35.16 x 120 Feet"," $2,779.20/2011",3," 3 Car Parking"," 1 x 4, 1 x 2 Piece",null,null,"July 31,2011 or TBA","Brian Public School","Pleasant View Junior High School","Sir John A Macdonald CI","Professionally Landscaped","Above ground windows","Sliding Door Walkout to Backyard"]
["km000437","SOLD","Family Residential",2,"Barnwood Court",998800,null,"On A Sought After Court! This Custom Home Has Tremendous Potential!","Over 2800 Sq. Ft Nestled Onto A Pretty and Mature Lot ","YORK MILLS/DON MILLS"," 43°45'11.07\"N"," 79°20'21.73\"W",{"$f":"IF(ISBLANK(K379),\"\",DMS_to_Dec(K379))","v":43.753075000000003},{"$f":"IF(ISBLANK(L379),\"\",DMS_to_Dec(L379))","v":-79.339369444444444},"http://www.karenmillar.com/spotlight_slideshow.php?id=km000437",null,null,null," 89 x 136 Feet"," $6,914.28/2011",4," Double Car Garage + 2 Car Parking"," 1 x 5, 1 x 4, 1 x 3, 1 x 2 Piece",null,null," 30 Days or TBA","Three Valleys PS","Milne Valley MS","George s Henry CI","Hardwood Flooring","Main Floor Family Room","Main Floor Laundry Room","Custom Contemporary Home","Over 2800 Sq.Ft","Steps to Ravine, Park, Tennis Courts and Children's Playscape","Steps to Donalda Golf and Country Club","On Sought After Court","3 Walkouts to Backyard","In-ground Swimming Pool"]
["km000438","SOLD","Family Residential",101,"Sedgemount Drive",399900,null,"Beautifully Renovated with Modern Kitchen","First Time Buyer Alert!","ELLESMERE/MARKHAM"," 43°45'50.22\"N"," 79°14'5.10\"W",{"$f":"IF(ISBLANK(K380),\"\",DMS_to_Dec(K380))","v":43.763950000000001},{"$f":"IF(ISBLANK(L380),\"\",DMS_to_Dec(L380))","v":-79.234750000000005},"http://www.karenmillar.com/spotlight_slideshow.php?id=km000438",null,null,null," 60 x 96 ft"," $2,213.34/2012"," 3 + 2"," Single car garage + 1 car parking"," 2 x 4 Piece",null,null,"30-60 days or tba","William Tredway Jr PS  ","JS Woodsworth Sr PS ","Cedarbrae CI  ","All Renovations 2012","Roof 2002","New Modern Kitchen","2 Updated 4 Piece Bathrooms","Large Side Yard","Updated Windows","100 Amp Service"]
["km000439","SOLD","Family Residential",39,"Caracas Road",659900,null,"This Spacious Semi is a Gem!","The Premium Location Has Unobstructed Views and Wonderful Privacy","BAYVIEW/SHEPPARD"," 43°46'2.62\"N"," 79°22'41.35\"W",{"$f":"IF(ISBLANK(K381),\"\",DMS_to_Dec(K381))","v":43.767394444444442},-79.378152777777771,"http://www.karenmillar.com/spotlight_slideshow.php?id=km000439",null,null,null,"39.50 x 97 Feet"," $3,362.42/2012"," 3 + 3"," Double driveway with 3 car parking"," 1 x 4, 1 x 3 Piece",null,null,"August 20th, 2012 or TBA","Elkhorn PS","Bayview MS","Earl Haig SS","Roof 1999","High Efficiency Furnace 2005","100 Amp Service","Easy Cleaning Windows","Premium Lot","Amazing Location","Steps to Bessarion Subway, shopping, gym, park and bike trails"]
["km000440","SOLD","Family Residential",15,"Whitefriars Drive",799900,null,"New Everything! Amazing Location!","Steps to Schools, Parks, and Shops!","UNDERHILL/LAWRENCE"," 43°44'54.62\"N"," 79°19'49.76\"W",43.748505555555553,-79.33048888888888,"http://www.karenmillar.com/spotlight_slideshow.php?id=km000440",null,null,null,"58 x 110 Feet"," $4,164.47/2012",4," Built-in Private Double Car Garage + 4 Car Parking"," 2 x 4, 1 x 2 Piece",null,null," 90 days or TBA","Cassandra PS","Milne Valley MS","Victoria Park CI","In-ground Pool 2005"," Roof 2007","R32 Insulation"," Low-E Windows 2003","New Hardwood Flooring","New Master Bedroom Addition","New Gas Fireplace","New Kitchen with Solid Maple Cabinet Doors","In-ground Irrigation in Front and Back","New Cabana with Hydro"]
["km000441","SOLD","Family Residential",18,"Dutch Myrtle Way",549900,null,"So Rare! End Unit Beauty!","This Executive Townhome Is One Of The Best Real Estate Investments You Can Make","DON MILLS/LAWRENCE"," 43°44'24.68\"N"," 79°20'35.72\"W",43.740188888888888,-79.343255555555544,"http://www.karenmillar.com/spotlight_slideshow.php?id=km000441",null,null,null,null," $2,861.14/2012",3," Single Car Garage + 1 Car Parking"," 2 x 4, 1 x 3, 1 x 2 Piece","$416.00/mo (includes water, cable tv, common elements and building insurance)",null,"60-90 Days or TBA","Greenland Public School, Norman Ingram Public School","Don Mills Middle School","Don Mills Collegiate Institute"," End unit","Furnace '98"," Central Air Conditioning '10"," Large Storage Room"," Oasis Backyard with Pond & Waterfall","New Broadloom '12","Steps to Shops at Don Mills","Steps to TTC, Library, Parks & Schools"]
["km000442","ARCHIVE","Luxury",32,"Parmbelle Crescent",1488800,null,"Backs onto Donalda Golf & Country Club","Totally Renovated Ranch Bungalow on Prestigious Street","YORK MILLS/DON MILLS"," 43°45'15.41\"N"," 79°20'30.98\"W",43.754280555555553,-79.34193888888889,"http://www.karenmillar.com/spotlight_slideshow.php?id=km000442",null,null,null,"85 x 125 Feet"," $7,947.19/2012"," 2 + 2"," Double Car Garage + 6 Car Parking"," 1 x 4, 1 x 3 , 2 x 2 Piece",null,null," 30 Days or TBA","Three Valleys PS","Milne Valley MS","George S. Henry Academy","Addition to Front, Back, Side & Lower Level","New Roof - 2012","New Driveway - 2012","2 Furnaces 2005 - one only ","2 Central Air Conditioners 2005 - one only","3 Fireplaces - 1 Gas & 2 Wood-Burning","Main Floor Family Room, Den & Large Mud Room","Renovated Lower Level Family Room & Bathroom - 2012","Desirable Street"]
["km000443","SOLD","Condo",75,"Graydon Hall Drive, 1706",258800,null,"2+1 Bedroom with Panoramic South Views","Spacious and Absolutely Exquisite Unit","DON MILLS"," 43°45'51.57\"N"," 79°20'40.30\"W",{"$f":"IF(ISBLANK(K385),\"\",DMS_to_Dec(K385))","v":43.764324999999999},-79.34452777777777,null,null,null,null,null," $1,706.77/2011"," 2 +1"," 1 Underground Spot"," 1 x 4, 1 x 2 Piece"," $731.67/mo includes water, hydro, heat, central air conditioning, parking, cable, building insurance & common elements",1,"After probate"," Rene Gordon ES"," Donview MS","George S Henry Academy"," Ensuite Laundry"," Parquet flooring","Panoramic views","Close to Shopping Mall, TTC and 401","Overlooks Graydon Hall Park"]
["km000444","SOLD","Condo",30,"Holly Street, 804",415500,null,"2 + 1 Bedroom with South Views of Downtown",null,"YONGE/EGLINTON"," 43°42'18.42\"N"," 79°23'45.17\"W",43.705116666666669,-79.395880555555564,null,null,null,null,null," $3,009.14/2011"," 2 + 1 "," 1 underground spot"," 2 x 4 Piece"," $999.10/mo includes water, hydro, central air conditioning","parking, heat, building insurance & common elements"," 30 Days or Tba","Eglinton Jr PS  ","Hodgson Sr PS ","North Toronto CI  "]
["km000445","ARCHIVE","Executive",20,"Kirkdale Crescent",1688800,null,"Super Banbury Residence, Super Location","Over 5000 sq. ft. Including Lower Level","LESLIE/LAWRENCE"," 43°44'18.36\"N"," 79°21'27.74\"W",43.738433333333333,-79.357705555555555,"http://www.karenmillar.com/spotlight_slideshow.php?id=km000445",null,null,null,"60 x 100 ft"," $10,526.85/2012"," 4 + 2"," Double car garage + 4 car parking"," 1 x 5, 1 x 4, 2 x 3, 1 x 2 Piece",null,null,"60-90 days or tba","Rippleton Public School","St Andrew's JHS */ Windfields JHS ","York Mills CI  ","Gourmet Kitchen","Roof Approx 2005","Stainless Steel Kitchen Appliances","3 Fireplaces","New Broadloom in Lower Level 2012"]
["km000446","SOLD","Family Residential",75,"Albertus Avenue",1198800,null,"Gorgeous North Toronto Home in John Ross Robertson Jr PS School District","Beautiful Oasis Backyard","YONGE/EGLINTON"," 43°42'50.62\"N"," 79°24'8.33\"W",43.714061111111114,-79.402313888888898,"http://www.karenmillar.com/spotlight_slideshow.php?id=km000446",null,null,null," 33.83 x 100 Feet"," $7,557.74/2012",3,"Single car garage"," 3 x 3, 1 x 2 Piece",null,null,"60 Days or TBA","John Ross Robertson Jr PS  ","Glenview Sr PS ","Lawrence Park CI */ North Toronto CI  ","Annual Block Party","Central Air Conditioning 2003","Skylights with Sun Coating","Garage Roof Replaced 2008","Water Pipes into Home from Property Line - 2010","Separate Entrance to Basement Apartment (not retro-fit)"]
["km000447","SOLD","Executive",61,"Laurentide Drive",998800,null,"Donalda Golf Club Ranch Bungalow","Updated Throughout with Perennial Gardens","YORK MILLS/LAWRENCE"," 43°45'12.35\"N"," 79°20'25.61\"W",43.753430555555553,-79.340447222222224,"http://www.karenmillar.com/spotlight_slideshow.php?id=km000447",null,null,null," 85 x 125 ft"," $5,950.90/2012"," 4 + 1","Double car garage + 4 car parking","1 x 4, 2 x 3 Piece",null,null,"60-90 Days or TBA","Three Valleys PS","Milne Valley MS","George S Henry Academy","Mostly New windows","Kitchen Appliances 2007","Roof 2004","Central Air Conditioning","3 Walkouts to Backyard","3 Updated Bathrooms"]
["km000448","SOLD","Executive",112,"Three Valleys Drive",1288800,null,"Backing On To Prestigious Donalda Golf Course","Stunning! Bright & Spacious Contemporary Home","YORK MILLS/DON MILLS"," 43°44'53.31\"N"," 79°20'15.66\"W",{"$f":"IF(ISBLANK(K390),\"\",DMS_to_Dec(K390))","v":43.748141666666669},{"$f":"IF(ISBLANK(L390),\"\",DMS_to_Dec(L390))","v":-79.337683333333331},"http://www.karenmillar.com/spotlight_slideshow.php?id=km000448",null,null,null," 60 x 138.85 ft."," $6,038.48/2012"," 2 + 1"," Single car garage + 2 car parking"," 1 x 4, 1 x 3, 1 x 2 Piece",null,null," 60 days or tba","Three Valleys PS","Milne Valley MS","George S Henry Academy","Major Renovations in 2006","Master Bedroom Addition with Dressing Room and Ensuite","New Hardwood Flooring","Newer Windows","Renovated Bathrooms","New Kitchen","New Broadloom in Lower Level Bedroom","Professionally Landscaped Gardens"]
["km000449","SOLD","Condo",205,"The Donway West, Suite 613",330000,null,"Wonderful Suite with Hardwood Flooring","Immaculate and Ready For You To Move-In!","DON MILLS/LAWRENCE"," 43°44'15.54\"N"," 79°20'44.71\"W",43.737650000000002,-79.345752777777776,null,null,null,null,null," $1,820.03/2012"," 1 + 1"," 2 Car Parking"," 1 x 4 Piece","489.21/mo (includes water, heat, hydro, central air conditioning, common elements & building insurance)",1," Immediate or TBA"]
["km000450","ARCHIVE","Luxury",null,"Custom Built Home",null,null,"Leslie & Lawrence 4000 sq ft Custom Built Home","For More Details Call Karen at 416-443-0300","LESLIE/LAWRENCE"," 43°44'27.68\"N"," 79°21'23.37\"W",{"$f":"IF(ISBLANK(K392),\"\",DMS_to_Dec(K392))","v":43.74102222222222},-79.356491666666656]
["km000451","SOLD","Condo",2191,"Yonge Street #4411",649900,null,"Spectacular Floor to Ceiling Views","Short Walk to Shops and Fabulous Dining Experiences","YONGE/EGLINTON"," 43°42'19.29\"N"," 79°23'52.16\"W",43.705358333333336,-79.397822222222231,"http://www.karenmillar.com/spotlight_slideshow.php?id=km000451",null,null,null,null," $3,925.40/2012",2," 1 car parking (close to elevator)"," 1 x 4, 1 x 3, 1 x 2 Piece"," $567.16/mo (includes parking, common elements and building insurance)",null," September 12, 2012 or tba","Eglinton Jr PS","Hodgson Sr PS ","North Toronto CI  ","Minto's Quantum 2","Open Concept Corner Unit","Floor to Ceiling Wrap Around Windows","Over 1000 sq ft.","Unobstructed North/East Views","Open Concept","Stainless Steel Kitchen Appliances","Amazing Amenities","Gourmet Kitchen with Granite Counters"]
["km000452","SOLD","Condo",750,"Bay Street #2005",469900,null,"Fabulous Corner Suite in the Sought After 'Penrose' Building","2 Bedrooms, 2 Bathrooms & 2 Balconies!","BAY/COLLEGE"," 43°39'34.24\"N"," 79°23'9.24\"W",43.659511111111108,-79.385900000000007,null,null,null,null,null," $2,544.95/2012",2," 1 Car Parking "," 1 x 4, 1 x 3 Piece"," $634.90/mo (includes heat, hydro, water, central air conditioning, common elements & building insurance)",1,"Immediate or TBA",null,null,null," Close to TTC"," Minutes to U of T"," Financial District"," Close to Hospitals"," Stainless Steel KitchenAid Appliances 2012"]
["km000453","SOLD","Condo",62,"Glen Echo Road",null,3200,"Updated Detached Home in Teddington Park","Minutes to Rosedale Golf Course","YONGE/LAWRENCE"," 43°44'3.88\"N"," 79°24'3.97\"W",{"$f":"IF(ISBLANK(K395),\"\",DMS_to_Dec(K395))","v":43.734411111111115},-79.40110277777778,null,null,null,null," 25 x 100.58 Feet",null,3," Detached Single Car Garage + 1 Car Parking"," 2 x 4 Piece",null,null,"September 2012 or TBA",null,null,null,"Quiet Street","Steps to Shops and Restaurants on Yonge Street","TTC and Easy Access to the 401","Sliding Doors to Private Garden - Great for Entertaining","Fully Finished Basement"]
["km000454","SOLD","Family Residential",54,"Celeste Drive",299000,null,null,null,"KINGSTON/GALLOWAY"," 43°45'31.47\"N"," 79°12'2.12\"W",43.758741666666666,-79.200588888888888,null,null,null,null,"45.42 x 110 Feet"," $2,305.88/2012"," 3 + 2"," 3 Car Parking"," 1 x 4, 1 x 3 Piece",null,null," 30 Days or TBA"]
["km000455","SOLD","Condo",4062,"Lawrence Ave. E, #302",121000,null,null,null,"LAWRENCE/MARKHAM"," 43°45'56.43\"N"," 79°11'53.91\"W",43.765675000000002,-79.198308333333344,null,null,null,null,null," $987.13/2012",3," 1 underground spot"," 1 x 4, 1 x 2 Piece"," $503.45/mo (includes water, heat, hydro, basic cable tv, central air conditioning, building insurance, common elements and parking)",null," 30 Days or TBA"]
["km000456","ARCHIVE","Condo",15,"Torrance Road, #104",129000,null,null,null,"EGLINTON/MCCOWAN"," 43°44'36.36\"N"," 79°14'12.88\"W",43.743433333333336,-79.236911111111112,null,null,null,null,null," $856.03/2012"," 1 + 1"," 1 parking spot"," 1 x 4 Piece"," $547.83/mo (includes water, heat, hydro, basic cable tv, central air conditioning, parking, common elements and building insurance)","Ensuite"," 30 Days or TBA"]
["km000457","SOLD","Family Residential",59,"Lowcrest Boulevard",449900,null,null,null,"WARDEN/SHEPPARD"," 43°46'18.93\"N"," 79°18'23.24\"W",{"$f":"IF(ISBLANK(K399),\"\",DMS_to_Dec(K399))","v":43.771924999999996},-79.306455555555559,null,null,null,null," 50 x 106 Feet"," $2,683.77/2012",3," Single car garage + 2 car parking"," 1 x 4, 1 x 3 Piece",null,null," 30 days or TBA"]
["km000458","SOLD","Family Residential",123,"Elvaston Drive",799900,null,"Beautifully Renovated Victoria Village Home","Luxurious Backyard Oasis","VICTORIA VILLAGE"," 43°43'44.97\"N"," 79°18'53.74\"W",43.729158333333338,-79.314927777777768,"http://www.karenmillar.com/spotlight_slideshow.php?id=km000458",null,null,null," 54 x 120 Feet"," $3,863.70/2012",4," Single car garage + 2 parking"," 1 x 4, 1 x 3 Piece",null,null," 90 days or tba","Sloane PS","Milne Valley MS","Victoria Park CI","Central Air Conditioning '08","European Windows","New Broadloom","2-Tier Wooden Deck","Koi Pond with waterfall and fountain"]
["km000459","SOLD","Family Residential",10,"Whitefriars Drive",799900,null,"Immaculate & Updated Thoughout","Beautiful Executive Family Home","LAWRENCE/UNDERHILL"," 43°44'53.32\"N"," 79°19'49.93\"W",43.748144444444442,-79.330536111111101,"http://www.karenmillar.com/spotlight_slideshow.php?id=km000459",null,null,null," 54 x 113 Feet"," $4,472.95/2012",4," Double car garage + 2 car parking"," 1 x 5, 2 x 3, 1 x 2 Piece",null,null,"December 2012 or TBA","Cassandra PS","Milne Valley MS","Victoria Park CI","Central Air Conditioning 2012","Tumbled Interlocking Brick Patio 2012","Landscaped Gardens","100 Amp Service","2 Gas-burning Fireplaces","Fully Fenced"]
["km000460","SOLD","Family Residential",38,"Deepwood Crescent",859900,null,"Rare Offering! Super Ravine Property with 18' x 32' Concrete In-Ground Pool!",null,"LAWRENCE/DON MILLS"," 43°44'13.37\"N"," 79°20'7.83\"W",43.737047222222223,-79.335508333333323,null,null,null,null," 68.02 x 132.49 Feet (irregular)"," $4,773.72/2012"," 3 + 2","Double car garage + 4 car parking"," 1 x 4, 1 x 3 Piece",null,null," October 2012 or Tba","Greenland PS/Norman Ingram PS","Don Mills MS ","Don Mills CI","Ravine Lot","Concrete In-ground Swimming Pool (18' x 32')","Custom Built Floor-to-ceiling Cabinet","2 Wood-burning Fireplaces","3 Walk-outs","Close to Shops at Don Mills, Restaurants, Parks, Ttc and Dvp","Very Sought After Street & Neighbourhood"]
["km000461","SOLD","Condo",319,"Merton Street #415",359900,null,"Opportunity Knocks!! One of the Largest 1 + 1 Units in the Building","684 sq ft with Balcony and Bright Westerly Views","MT PLEASANT/MERTON"," 43°41'52.01\"N"," 79°23'11.92\"W",{"$f":"IF(ISBLANK(K403),\"\",DMS_to_Dec(K403))","v":43.697780555555553},-79.386644444444457,null,null,null,null,null," $2,683.77/2012"," 1 + 1 "," 1 Underground parking spot"," 1 x 4 Piece"," $438.84/mo (includes water, heat, parking, central air conditioning, building insurance & common elements)",1,"Immediate or TBA",null,null,null," "]
["km000462","SOLD","Family Residential",39,"Lynedock Crescent",599900,null,"Beautifully Renovated Throughout Including European Windows","Wonderful Family Home and Just Steps to Shops, Parks, Library, Schools and TTC","YORK MILLS/FENSIDE"," 43°45'40.61\"N"," 79°19'54.47\"W",43.761280555555558,-79.331797222222221,"http://www.karenmillar.com/spotlight_slideshow.php?id=km000462",null,null,null," 57.81 x 163.38 Feet"," $3,400.98/2012",3," Double car garage + 2 car parking"," 1 x 4, 1 x 3 Piece",null,null,"30 days or TBA","Fenside Public School","Donview Middle School","George S Henry Academy","Roof '99","Furnace '96","100 Amp Service","Re-finished Hardwood Flooring"," Windows '96"]
["km000463","SOLD","Family Residential",8,"Frater Avenue",535900,null,null,null,"WOODBINE/SAMMON"," 43°41'25.79\"N"," 79°19'19.50\"W",43.69049722222222,-79.322083333333325,null,null,null,null," 38 x 103 Ft"," $3,370.14/2012",2," Single car garage + 2 car parking"," 1 x 4 Piece",null,null,"30 days or tba"]
["km000464","SOLD","Family Residential",19,"Marthclare Avenue",649900,null,"Beautifully Renovated Throughout","Steps to Shops, Parks and Schools Including French Immersion","LAWRENCE/UNDERHILL"," 43°44'30.10\"N"," 79°19'14.34\"W",{"$f":"IF(ISBLANK(K406),\"\",DMS_to_Dec(K406))","v":43.741694444444448},-79.320650000000001,"http://www.karenmillar.com/spotlight_slideshow.php?id=km000464",null,null,null," 45 x 133"," $3,724.89/2012"," 4 + 1"," Double Car Garage + 6 Car Parking"," 1 x 4, 1 x 2, 1 x 1 Piece",null,null," Dec/Jan or TBA"," Cassandra PS/Ranchdale PS"," Milne Valley MS"," Victoria Park CI"," Kitchen 2012"," 4 Piece Bathroom 2009"," Furnace 2007"," Central Air Conditioning 2006"," 100 Amp Service"," New Pot Lights"," Refinished Hardwood Flooring"," Roof 1997 & Garage Roof 2012"," Humongous Backyard"," Super Long Driveway"]
["km000465","SOLD","Family Residential",12,"Whitefriars Drive",759900,null,"Beautifully Upgraded Executive Family Home on a Sought After Street in a Demand Location",null,"LAWRENCE/UNDERHILL"," 43°44'53.85\"N"," 79°19'50.10\"W",43.748291666666667,-79.330583333333323,"http://www.karenmillar.com/spotlight_slideshow.php?id=km000465",null,null,null," 54 x 113 Feet"," $4,041.08/2012",4," Single car garage + 3 car parking"," 1 x 4, 1 x 2 Piece",null,null," 30-60 Days or TBA"," Cassandra PS/Ranchdale PS"," Milne Valley MS"," Victoria Park CI"," Roof 2001"," Furnace 2004"," Windows 2004"," Refinished Hardwood Flooring"," 100 Amp Service"," Central Air Conditioning"," 4 Piece Bathroom 2009"," Patio Doors 2004"," Attic Insulation Upgraded"," Eco Energy Audit 2010"," Eavestroughs, Soffits, Fascia & Downspouts 2011"," Garage Door Opener 2012"]
["km000466","ARCHIVE","Family Residential",42,"Karen Road",799900,null,"Super Family Home with In-Law Potential","Wonderful 4 Bedroom Backsplit with 2nd Floor Addition with Separate Entrance","YORK MILLS/VALENTINE"," 43°45'46.31\"N"," 79°20'21.50\"W",43.762863888888887,-79.339305555555555,"http://www.karenmillar.com/spotlight_slideshow.php?id=km000466",null,null,null," 53.25 x 112.58 Feet"," $5,205.59/2012",6," Double car garage + 4 car parking"," 3 x 4 Piece",null,null,"60 Days or TBA"," Rene Gordon ES"," Donview MS"," George S Henry Academy","Perfect for 2 Families"," Hardwood Flooring"," Stainless Steel Appliances"," Close Proximity to Schools, Shops, Parks & TTC","In-Ground Swimming Pool"]
["km000467","SOLD","Family Residential",90,"David Dunlap Circle",599999,null,"Spacious and Bright Executive Freehold Townhome is over 2000 Sq. Ft",null,"DON MILLS/GREENBELT"," 43°43'45.42\"N"," 79°20'6.57\"W",{"$f":"IF(ISBLANK(K409),\"\",DMS_to_Dec(K409))","v":43.729283333333335},-79.335158333333325,"http://www.karenmillar.com/spotlight_slideshow.php?id=km000467",null,"http://www.youtube.com/embed/ZUJbll-IPzQ","N"," 13.12 x 80.38 ft"," $3,562.94/2012"," 3 + 1"," Single car garage with Automatic Garage Remote + 1 Covered Car Parking"," 2 x 4, 1 x 3 Piece",null,null," 60-90 days or tba","Greenland PS/Norman Ingram PS","Don Mills MS","Don Mills CI","High Efficiency Furnace '02","100 Amp Service","3/4\" Waterline","Central Air Conditioning","Private Backyard"]
["km000468","ARCHIVE","Family Residential",50,"Crossburn Drive",1628800,null,"Drop Dead Gorgeous! Backing on to Chipping Park","Magnificent Renovations Throughout","LAWRENCE/DON MILLS"," 43°44'38.17\"N"," 79°20'29.35\"W",43.743936111111111,-79.341486111111109,"http://www.karenmillar.com/spotlight_slideshow.php?id=km000468",null,null,null," 45 x 133 Ft (irregular 70' Rear) **Ravine**"," $6,416.37/2012"," 4 + 1"," Double car garage + 2 car parking"," 2 x 5, 1 x 3, 1 x 2 Piece",null,null,"90-120 days or tba","Greenland PS/Norman Ingram PS","Don Mills MS","Don Mills CI","High Efficiency Furnace '96","In-Ground Swimming Pool with Waterfall & Heater '99","200 Amp Service","Renovated Lower Level '12","3 Piece Bathroom '12","Central Air Conditioning ","Custom Blinds","Central Vacuum"]
["km000469","SOLD","Family Residential",10,"Shawfield Crescent",759900,null,"Super Family Home on a Sought After Street","Rare 60 ft Lot and Beautifully Landscaped","LAWRENCE/UNDERHILL"," 43°45'1.51\"N"," 79°19'30.26\"W",43.750419444444447,-79.325072222222218,"http://www.karenmillar.com/spotlight_slideshow.php?id=km000469",null,null,null," 59.2 x 101.58 ft"," $4,149.05/2012",4," Double Car Garage + 2 Car Parking"," 1 x 4, 2 x 2 , 1 x 1 Piece",null,null,"Immediate or tba","Ranchdale PS","Milne Valley MS","Victoria Park CI","Stainless Steel Fridge, Stove & Dishwasher","Patten Concrete Double Driveway","Steps to Schools, Shops, Ravine, DVP/401 and TTC"]
["km000470","SOLD","Family Residential",57,"Camwood Crescent",688800,null,"This is a Gem! Updated Throughout!","Updated Kitchen with Stainless Steel Appliances","YORK MILLS/DON MILLS"," 43°45'37.75\"N"," 79°20'18.19\"W",{"$f":"IF(ISBLANK(K412),\"\",DMS_to_Dec(K412))","v":43.760486111111113},-79.338386111111106,"http://www.karenmillar.com/spotlight_slideshow.php?id=km000470",null,"http://www.youtube.com/embed/KPlXPDqVgTk","N"," 53.16 x 117.27 Ft"," $4,349.56/2012"," 3 + 4"," Single car garage + 5 car parking"," 2 x 4 Piece",null,null," 30-60 Days or TBA","Rene Gordon ES","Donview MS","George S Henry Academy","Roof '98","Furnace '98","Central Air Conditioning '98'","100 Amp Service","Updated Windows"]
["km000471","SOLD","Family Residential",7,"Chrysler Crescent",449900,null," Location, Location, Location!"," Spacious, Charming & Well Maintained Bungalow","VICTORIA PARK/LAWRENCE"," 43°44'40.12\"N"," 79°18'26.20\"W",43.744477777777782,-79.30727777777777,"http://www.karenmillar.com/spotlight_slideshow.php?id=km000471",null,null,null," 49 x 108 ft"," $2,745.47/2012",3," Single car garage + 3 car parking"," 1 x 4, 1 x 2 Piece",null,null," Immediate or TBA"," Buchanan PS"," Buchanan PS"," Wexford CI"," Original Owner"," Wood Burning Fireplace"," Roof '04"," Fenced Back Garden"," Interlocking Brick Walkway to Perennial Garden"]
["km000472","SOLD","Condo",700,"King Street West #314",378800,null,"Beautiful Unobstructed South Views!","Attractive Built-ins Mean Storage Galore!","KING ST.W./BATHURST"," 43°38'37.99\"N"," 79°24'11.50\"W",43.643886111111108,-79.403194444444452,"http://www.karenmillar.com/spotlight_slideshow.php?id=km000472",null,null,null,null," $2,313.59/2012"," 2 + 1",null," 1 x 4, 1 x 3 Piece"," $533.81/mo (includes heat, water, central air conditioning, common elements & building insurance)","1 extra large locker (#334 across from unit)","March 2013 or tba","Niagara Street Jr PS","Ryerson CS","Parkdale CI","Converted in 2003","24 Hour Concierge","11 Ft. Ceilings"," Walking Distance to Financial District","Steps to Shops, Restaurants & Transit"]
["km000473","SOLD","Family Residential",83,"Hockley Avenue",359900,null,"Gorgeous! Over 2100 sq ft of Sun-flooded and Spacious City-Type Living!",null,"WEST SCUGOG/CONC 3"," 43°55'54.82\"N"," 78°42'15.94\"W",{"$f":"IF(ISBLANK(K415),\"\",DMS_to_Dec(K415))","v":43.931894444444445},-78.704427777777781,"http://www.karenmillar.com/spotlight_slideshow.php?id=km000473",null,null,null," 42.65 x 105 ft"," $4469.00/2012",4," 2 Car Garage with Direct Access + Double Private Driveway"," 2 x 4, 1 x 2 Piece",null,null," 30-60 days or tba","Charles Bowman Public School","Charles Bowman Public School","Bowmanville High School","Hi Efficiency Furnace 2010","100 Amp Service","Rental Alarm System","Cold Room"]
["km000474","SOLD","Family Residential",2,"Stonedale Placeway",579900,null," Denlow School District!!","End Unit in Most Sought After Neighbourhood!  Rare Opportunity!! ","LESLIE/YORK MILLS"," 43°45'6.63\"N"," 79°21'37.27\"W",43.751841666666664,-79.360352777777777,"http://www.karenmillar.com/spotlight_slideshow.php?id=km000474",null,null,null,null," $3,100.22/2012",3," Single car garage + 1 car parking"," 1 x 4, 1 x 3, 1 x 2 Piece"," $470/mo (includes cable, water, street and driveway snow removal, exterior maintenance, garbage & recycling removal, building insurance and common elements)",null," June 2013 or TBA"," Denlow PS"," Windfields JHS"," York Mills CI"," Denlow School District"," Rare Model - Ground Entry"," Roof 2009"," Driveway 2012"," Spacious & Beautifully Maintained"," Updates Throughout"," Steps to Shops, Parks, Ttc & Restaurants"]
["km000475","SOLD","Family Residential",18,"Hirondelle Place",799900,null,"Gorgeous! Exquisitely Renovated!","Executive Bungalow Nestled on Exclusive Cul-de-Sac","LAWRENCE/UNDERHILL"," 43°45'14.29\"N"," 79°19'31.66\"W",43.753969444444444,-79.32546111111111,"http://www.karenmillar.com/spotlight_slideshow.php?id=km000475",null,null,null," 60 x 100 Ft"," $4,472.95/2012"," 3 + 1"," Single car garage + 3 car parking"," 1 x 5, 1 x 4 Piece",null,null," 30 Days or TBA","Ranchdale PS","Milne Valley MS","Victoria Park CI","100 Amp Service","Betz Heated Concrete Pool & Equipment","High Efficiency Gas Furnace","California Shutters","Central Vacuum","Garage Storage Loft, Shelving & Cupboards","Lawn & Underground Sprinkler System"]
["km000476","SOLD","Family Residential",45,"Aldenham Crescent",998800,null,"Rare! Super Size Family Room!","Beautifully Upgraded Throughout","LAWRENCE/UNDERHILL"," 43°45'5.14\"N"," 79°19'41.54\"W",43.751427777777778,-79.328205555555556,"http://www.karenmillar.com/spotlight_slideshow.php?id=km000476",null,null,null,"50 x 112 ft & 79ft at Rear"," $5,537.20/2012",5," Double Car Garage + 4 Car Parking"," 1 x 5, 1 x 4, 1 x 3, 1 x 2 Piece",null,null," June 15th 2013 or TBA"," Cassandra PS","Milne Valley MS","Victoria Park CI"," Newer Roof","100 Amp Service","Central Air Conditioning"," In-Ground Salt Water Pool","Renovated Kitchen And Bathrooms","Renovated Bathroom","Hardwood Flooring","New Broadloom 2013 in Lower Level"]
["km000477","SOLD","Condo",7601,"Bathurst Street #815",399900,null,"Largest Corner Unit! Renovated & Gorgeous!","Contemporary & Open Concept!","BATHURST/CENTRE"," 43°48'34.87\"N"," 79°26'56.24\"W",43.809686111111105,-79.448955555555557,"http://www.karenmillar.com/spotlight_slideshow.php?id=km000477",null,null,null,null," $2,297.58/2012",2," 2 Underground Tandem Spots"," 1 x4, 1 x 3 Piece"," $749.26/mo includes water, heat, hydro, cable, central air conditioning, parking, building insurance & common elements"," None"," 60 Days or TBA",null,null,null,"Ensuite Laundry with Storage Space"," Beautifully Engineered Hardwood Flooring","Unobstructed Panoramic Views","24hr Gatehouse & Security","Extensive Lobby/Common Area/Hallway Renovations - Completed Summer 2013","Minutes to Promenade Mall, Synagogues, Library, Parks, Schools, Community Centre & Highways","Amenities: Whirlpool & Sauna, Outdoor Swimming Pool, Exercise Room, Racquetball Court, Squash Court, Library, Outdoor BBQ, Tennis Court, Party Room, Billiard Room & Visitor Parking"]
["km000478","SOLD","Condo",140,"Simcoe Street #402",359900,null," Stunning!!! 698 Sq. Ft.","Heart of Downtown Toronto","RICHMOND/UNIVERSITY"," 43°38'58.52\"N"," 79°23'13.64\"W",{"$f":"IF(ISBLANK(K420),\"\",DMS_to_Dec(K420))","v":43.649588888888886},-79.387122222222231,"http://www.karenmillar.com/spotlight_slideshow.php?id=km000478",null,null,null,null," $2,305.88/2012"," 1 + 1"," 1 Underground parking spot"," 1 x 4 Piece"," $384.12/mo includes water, heat, parking, building insurance & common elements",1," Immediate or TBA","Ogden Jr PS","Ryerson CS","Harbord CI","Laminate Flooring","Freshly Painted","Mostly Stainless Steel Appliances","Granite Counter","Steps to Shops, Restaurants & Transit"]
["km000479","SOLD","Family Residential",93,"Berkinshaw Crescent",759900,null,"Builder's/Renovators Delight!","Amazing Location! Close to Ttc, Shops & Restaurants!","DON MILLS/LAWRENCE"," 43°44'27.44\"N"," 79°20'55.83\"W",43.740955555555558,-79.348841666666658,"http://www.karenmillar.com/spotlight_slideshow.php?id=km000479",null,null,null," 62 x 96 ft"," $4,449.81/2012",3," Single car garage + 3 car parking"," 1 x 4, 1 x 3 Piece",null,null," Immediate or TBA","Greenland PS */ Norman Ingram PS  ","Don Mills MS ","Don Mills CI  "," Hardwood Flooring"," Central Vacuum"," Newer Furnace"]
["km000480","SOLD","Executive",62,"Clarinda Drive",998800,null,"Fantastic Interior Planning & Exterior Appeal","Spacious Executive Four Bedroom Home","BAYVIEW/SHEPPARD"," 43°46'31.14\"N"," 79°22'20.18\"W",43.775316666666669,-79.372272222222222,"http://www.karenmillar.com/spotlight_slideshow.php?id=km000480",null,null,null," 50.62 x 118.71 Ft"," $6,454.93/2012",4,"Double car garage + 2 car parking","2 x 5, 1 x 2 Piece",null,null," Immediate or TBA","Elkhorn Ps","Bayview MS","Earl Haig SS"," Furnace 2012"," Central Air Conditioning 2012"," 100 Amp Service","Intercom System"]
["km000481","SOLD","Condo",1029,"King Street W Unit 1011",349900,null,"Stunning 3 Level Penthouse","King West Village - Steps to Exciting Entertainment, Restaurants, Unique Shops, Waterfront Trails & Parks","KING/STRACHAN"," 43°38'28.12\"N"," 79°24'57.50\"W",43.641144444444443,-79.415972222222223,"http://www.karenmillar.com/spotlight_slideshow.php?id=km000481",null,null,null,null," $2,182.49/2012",1," One Oversized Parking Spot for Penthouse (B30)"," 1 x 4 Piece"," $440.48/mo includes water, heat, hydro, central air conditioning, parking, building insurance and common elements"," B167"," 60 Days or TBA",null,null,null,"Located in King West Village","Penthouse Suite","Parking & Locker","Ensuite Laundry ","Private Roof Top Terrace ","High Ceilings"]
["km000482","SOLD","Family Residential",187,"Roywood Drive",608800,null,"Rare & Contemporary Sidesplit on a Huge Lot","Sun-filled & Upgraded Throughout","YORK MILLS/DVP"," 43°45'53.59\"N"," 79°19'58.23\"W",43.76488611111111,-79.332841666666667,"http://www.karenmillar.com/spotlight_slideshow.php?id=km000482",null,null,null," 50 x 140 Ft"," $3,252.96/2012"," 3 + 1"," 6 Car Parking"," 1 x 4, 1 x 3 Piece",null,null," 90 Days or TBA","Fenside PS"," Donview MS"," George S Henry Academy"," Furnace 2009"," Central Air Conditioning"," Roof 2007"," 100 Amp Service"," Open Concept"," Newer Kitchen"]
["km000483","SOLD","Family Residential",29,"Deepwood Crescent",788800,null,"Immaculate Extra Large Bungalow in One of Don Mills' Most Sought After Neighbourhoods!",null,"LAWRENCE/DON MILLS"," 43°44'16.60\"N"," 79°20'9.50\"W",{"$f":"IF(ISBLANK(K425),\"\",DMS_to_Dec(K425))","v":43.737944444444445},-79.335972222222225,"http://www.karenmillar.com/spotlight_slideshow.php?id=km000483",null,null,null," 100.08 x 76 ft."," $4,457.52/2012"," 3 + 1"," Single car garage + 4 Car Parking"," 1 x 4, 1 x 3 Piece",null,null," Immediate or TBA","Greenland PS/Norman Ingram PS","Don Mills MS ","Don Mills CI"," Electric Furnace 2006","Heat Pump (a/c) 2006"," Roof 2006"," 100 Amp Service"," Irrigation System"," Automatic Garage Door 2012","Fully Insulated Recreation Room"," Enormous wrap-around lawn"]
["km000484","SOLD","Family Residential",32,"Shawfield Crescent",744400,null," Opportunity Knocks with This Super Family Home in One of Don Mills' Most Sought After Neighbourhoods",null,"LAWRENCE/UNDERHILL"," 43°45'4.15\"N"," 79°19'28.06\"W",43.751152777777776,-79.324461111111106,"http://www.karenmillar.com/spotlight_slideshow.php?id=km000484",null,null,null," 57.5 x 108.5 ft."," $4,010.23/2012",3," Single car garage + 2 car parking"," 1 x 4, 1 x 3, 1 x 2 Piece",null,null," Immediate or TBA"," Ranchdale PS"," Milne Valley MS"," Victoria Park CI"," Hardwood Flooring"," High Efficiency Furnace"," Breakfast Area","Sliding Door Walkout to Backyard "," Backyard Oasis Potential"]
["km000485","SOLD","Family Residential",92,"Three Valleys Drive",848800,null,"Renovators & Builders! This Is A Dream Home Waiting For Your Personal Touches","Floor-to-Ceiling Windows Bring the Outside Indoors","YORK MILLS/DON MILLS"," 43°44'56.79\"N"," 79°20'19.46\"W",43.749108333333332,-79.338738888888884,"http://www.karenmillar.com/spotlight_slideshow.php?id=km000485",null,null,null," 70 x 115 ft (Rear 80' South Side 106')"," $5,089.91/2012",5," Single Carport + 2 car parking","1 x 4, 1 x 3 Piece",null,null," Immediate or TBA","Three Valleys PS","Milne Valley MS","George S Henry Academy"," Updated Bathrooms"," Updated Kitchen","Great Lot Size in Sought After Donalda Golf & Country Club Neighbourhood"]
["km000486","SOLD","Executive",17,"Whitefriars Drive",739900,null," 4 Bedroom Executive Family Home in Sought After Neighbourhood",null,"LAWRENCE/UNDERHILL"," 43°44'55.05\"N"," 79°19'49.80\"W",43.748625000000004,-79.330500000000001,"http://www.karenmillar.com/spotlight_slideshow.php?id=km000486",null,null,null," 58 x 110 ft"," $3,987.09/2012",4," Single car garage + 2 car parking"," 1 x 4, 1 x 2 Piece",null,null," 30 days or tba","Cassandra PS","Milne Valley MS","Victoria Park CI"," Newer Windows"," Newer Front & Exterior Doors"," Built-in Dishwasher 2011"," Washer & Dryer 2011"," 100 Amp Service"]
["km000487","SOLD","Family Residential",32,"Castlegrove Boulevard",779900,null," Super Sidesplit Beautifully Renovated Throughout!"," Gorgeous Open Kitchen to Breakfast Area and Dining Room!","LAWRENCE/UNDERHILL"," 43°44'48.94\"N"," 79°19'20.94\"W",43.746927777777778,-79.322483333333324,"http://www.karenmillar.com/spotlight_slideshow.php?id=km000487",null,null,null," 55.73 x 105.56 ft"," $4,465.24/2012",3," Single Car Garage + 2 Car Parking"," 1 x 4, 1 x 2 Piece",null,null," 60 days or tba"," Cassandra PS/Ranchdale PS"," Milne Valley MS"," Victoria Park CI"," Furnace 2009"," Roof 2010"," Central Air Conditioning 2009"," Eco Audit 2009"," 100 Amp Service","In-Ground Swimming Pool & Equipment"," 2-Tiered Wooden Deck"," Newer Kitchen"," Newer Bathrooms"," Central Vacuum"]
["km000488","SOLD","Family Residential",335,"Woodsworth Road",589900,null,"Beautifully Updated Home in Super Demand Neighbourhood",null,"LESLIE/YORK MILLS"," 43°45'47.69\"N"," 79°21'51.97\"W",{"$f":"IF(ISBLANK(K430),\"\",DMS_to_Dec(K430))","v":43.763247222222219},-79.364436111111104,"http://www.karenmillar.com/spotlight_slideshow.php?id=km000488",null,null,null," 30.17 x 116.78 ft"," $3,169.62/2012",3," 2 car parking"," 1 x 4, 1 x 3 Piece",null,null,"60/90 days or tba","Dunlace PS","Windfields JHS","York Mills CI"," Hardwood Flooring Throughout Main & Upper Level"," Stainless Steel Kitchen Appliances"," Fully Fenced Backyard"," Close to Parks, Schools, Shops, Ttc, DVP & Highway 401"]
["km000489","SOLD","Executive",77,"Chelford Road",3349000,null,"Barbini Built Home","Designed and Built for Owner","LESLIE/LAWRENCE"," 43°44'28.86\"N"," 79°21'43.54\"W",43.741350000000004,-79.362094444444438,"http://www.karenmillar.com/spotlight_slideshow.php?id=km000489",null,null,null," 120.79 x 167.42 ft."," $20,475.31/2012"," 5 + 1"," Oversized tandem 3 car garage + 7 car parking"," 1 x 5, 3 x 4, 2 x 3, 2 x 2 Piece",null,null,"60 days or to be arranged"," Rippleton PS"," St. Andrew's JHS/Windfields JHS"," York Mills CI"," Designed & Built for Owner"," 2 HVAC Systems"," 200 Amp Service"," Bunker/Storage Room"," Wine Room with Walnut Cabinets"," In-Ground Sprinkler System"," Gas BBQ Line"," Intergrated Russound Sound System with Speakers"]
["km000490","ARCHIVE","Executive",68,"Clarinda Drive",1288800,null,"Stunning Executive Home in One of Toronto's Most Sought After Neighbourhoods","Lots of Upgrades Throughout","SHEPPARD/LESLIE"," 43°46'31.84\"N"," 79°22'21.32\"W",43.775511111111108,-79.372588888888885,"http://www.karenmillar.com/spotlight_slideshow.php?id=km000490",null,null,null," 53 x 103.87 ft"," $5,953.65/2012"," 4 + 1"," Double car garage + 2 car parking","1 x 5, 1 x 4, 1 x 3, 1 x 2 Piece + Sauna",null,null," August/September or tba","Elkhorn Ps","Bayview MS","Earl Haig SS","Hi Efficiency Furnace 2000"," Central Air Conditioning 2000"," 100 Amp Service"," Newer Windows"," Roof April 2013"," Kitchen 2009"," Bathrooms 2009"," Heated Flooring in Upper Bathrooms"," Super-Sized Sauna"," Refinished Lower Level"," R50 Insulation"," Garage Door Openers"," BBQ Gas Hook-Up"," Central Vacuum"]
["km000491","SOLD","Condo",1105,"Leslie Street, Unit 307",283900,null," Super Upscale 'Carrington on the Park' Condo","Open Concept & Beautifully Upgraded Kitchen with Floating Island","LESLIE/EGLINTON"," 43°43'15.06\"N"," 79°20'55.90\"W",{"$f":"IF(ISBLANK(K433),\"\",DMS_to_Dec(K433))","v":43.720849999999999},-79.348861111111106,"http://www.karenmillar.com/spotlight_slideshow.php?id=km000491",null,null,null,null," $1,642.65/2012",1," 1 Underground parking spot"," 1 x 4 Piece","$469.73/mo includes water, heat, building insurance & common elements)",1," 90 days or tba"," Rippleton PS"," Don Mills MS"," Don Mills CI"," 9 ft Ceilings"," 2 Sliding Door Walkouts"," Open Concept"," Super Sized Balcony Overlooks Courtyard"," Engineered Flooring"," Upgraded Kitchen"," Air Conditioning"," Amenities Include: 24hr Concierge/Security, Designer Party Room with Kitchen & Bar, Exercise Rooms with His & Her Showers, Lockers & Saunas, Theatre Room for Private Screening, Sports Lounge with Billiards Table, Dart Board & Television, Car Wash Bay in Underground Parking Garage, Designer Decorated Guest Suite & Visitor Parking"]
["km000493","SOLD","Family Residential",166,"Brookbanks Drive",868800,null,"Charming Home with Sparkle on a Ravine-Like Lot ","3 Additions Bringing The Outside In!","YORK MILLS/DVP"," 43°45'29.22\"N"," 79°19'44.70\"W",{"$f":"IF(ISBLANK(K434),\"\",DMS_to_Dec(K434))","v":43.758116666666666},{"$f":"IF(ISBLANK(L434),\"\",DMS_to_Dec(L434))","v":-79.32908333333333},"http://www.karenmillar.com/spotlight_slideshow.php?id=km000493",null,null,null," 54.5 x 135 ft"," $4,974.23/2012"," 3 + 1"," Carport + 3 Car Parking"," 1 x 4, 1 x 3, 1 x 2 Piece",null,null," 90 Days or TBA","Ranchdale PS","Donview MS","Victoria Park CI"," Newer Kitchen & Bathrooms"," Mostly Newer Windows"," Roof '13"," Central Air Conditioning '04"," Furnace '00"," Newer Broadloom"," Walk-up Lower Level"," Super Sized Crawl Space"," Steps to Schools, Parks, Ravines, Shops, TTC, 401 & DVP"]
["km000494","SOLD","Family Residential",5,"Vancouver Avenue",499900,null," Cool & Extremely Funky Home in the 'Hot Spot' of Leslieville"," Exquisite Loft-Like Home Just Steps to Vibrant Dining & Designer Shops","QUEEN/GREENWOOD"," 43°39'54.59\"N"," 79°19'26.98\"W",{"$f":"IF(ISBLANK(K435),\"\",DMS_to_Dec(K435))","v":43.665163888888884},-79.32416111111111,"http://www.karenmillar.com/spotlight_slideshow.php?id=km000494",null,null,null," 15.17 x 83.42 ft."," $2,298.17/2012",2," 1 Laneway Parking"," 1 x 4, 1 x 2 Piece",null,null," August 2013 or tba"," Duke of Connaught Jr & Sr PS"," Duke of Connaught Jr & Sr PS"," Riverdale CI"," Located in Leslieville Neighbourhood"," Renovated Kitchen 2009"," Wooden Deck 2009"," Central Air Conditioning 2009"," High-Efficiency Furnace 2008"," Roof 2008"," Eaves Troughs 2009"," 200 AMP Service"," Front Stone Walkway & Garden 2011"," New Front Porch 2011"," New Broadloom in Lower Level"," New Siding in Back"," Newer Bathroom"," Newer Windows"," Steps to Parks, Schools, Transit, Shopping & Restaurants"]
["km000495","SOLD","Executive",23,"Ruden Crescent",1388800,null,"Gorgeous Unique Georgian Styled Home"," Beautifully Updated Home in Sought After Neighbourhood","DON MILLS/YORK MILLS"," 43°45'30.15\"N"," 79°20'36.46\"W",43.758375000000001,-79.343461111111111,"http://www.karenmillar.com/spotlight_slideshow.php?id=km000495",null,null,null," 68.69’(front) x 158.18 feet (SE side) (136.09 NW side x 80’ back)"," $6,613.07/2013 ",4," Double Car Garage + 2 Car Parking "," 1 x 6, 2 x 3, 1 x 2 Piece",null,null," 30-60 Days or TBA"," Rene Gordon ES"," Donview MS"," George S Henry Academy"," Roof '09"," 17 Double-Glazed Georgian-Style Wooden Windows '09 (45k)"," Balcony Railings '10"," Re-Aligned Guttering; Downpipes Disconnected from Storm Drain '11"," Upper Level 3 Piece Bathroom '10"," Gas Fireplace with Slate Surround"," Bosch Washer & Dryer '12"," New Broadloom on Upper Level Landing & 3 Bedroom '13"," Pool Converted to Salt Water '06"," Pool Heater & Pump '08"," Winter Safety Cover '08"," Automatic Pool Cleaner"," Wiarton Stone Walls & Steps"," New Front Sprinkler System with Rain Sensor '09"," Professionally Landscaped Stone Walls, Perennials, Trees & Shrubs"," 200 Amp Service"," Over $200,000 in Improvements"," Professionally Landscaped Gardens (60k)"," "]
["km000496","SOLD","Family Residential",54,"Cobham Crescent",599900,null," This is a Great Upgraded & Spacious Bungalow with In-Law Potential in the Lower Level"," Come Raise Your Family & Enjoy!","VICTORIA PARK/LAWRENCE"," 43°44'18.71\"N"," 79°18'39.75\"W",43.738530555555556,-79.311041666666668,"http://www.karenmillar.com/spotlight_slideshow.php?id=km000496",null,null,null," 50 x 120 ft."," $3,748.02/2012"," 3 + 1"," Single car garage + 2 car parking"," 1 x 4, 1 x 2 Piece",null,null," 60 days or tba"," Victoria Village PS"," Milne Valley MS"," Victoria Park CI"," New Kitchen '04"," 4 Piece Bathroom '06"," Fence & Patio '09"," Central Air Conditioning '11"," 100 Amp CB"," Gas BBQ Hook-up"," Close top Schools, Parks, Ttc, Dvp & the 401"]
["km000497","SOLD","Family Residential",97,"Plateau Crescent",799900,null,"Stunning! Beautifully Renovated Bungalow in the Heart of Don Mills!","Exquisite Modern & Open Kitchen Overlooking Living Room & Dining Room","DON MILLS/LAWRENCE"," 43°43'58.18\"N"," 79°20'13.16\"W",43.732827777777779,-79.336988888888882,"http://www.karenmillar.com/spotlight_slideshow.php?id=km000497",null,null,null," 60 x 100 ft."," $4,103.56/2013",3," 3 Car Parking"," 1 x 4, 1 x 3 Piece",null,null," 60 days or tba"," Greenland PS/Norman Ingram PS"," Don Mills MS"," Don Mills CI"," Kitchen 2011"," Hardwood Flooring 2011"," Bathrooms 2011 & 2012"," Deck 2011"," Windows 2010"," Central Air Conditioning "," Re-Insulated Vaulted Ceiling 2010"," Insulated Lower Level 2012"]
["km000498","SOLD","Family Residential",45,"Plateau Crescent",1288800,null,"Beautifully & Extensively Renovated in 2007","This Home Sparkles from Top to Bottom!","DON MILLS/LAWRENCE"," 43°43'56.32\"N"," 79°20'10.99\"W",43.732311111111116,-79.336386111111111,"http://www.karenmillar.com/spotlight_slideshow.php?id=km000498",null,null,null," 75 x 100 ft."," $5,677.14/2013"," 4 + 1"," Double car garage+ 4 car parking"," 3 x 4 Piece",null,null," September/October"," Greenland PS/Norman Ingram PS"," Don Mills MS"," Don Mills CI"," Extensive Renovations 2007"," Roof 2007"," Furnace 2007"," Super Size Dining Room"," Entertainment Size Principle Rooms"," 200 Amp Service"," Downsview Kitchen & Bathrooms"," Hunter Douglas Window Coverings"," Kate Fox-Whyte Designed Landscaping"," In-ground Sprinkler System"," Extensive Landscape Lighting"]
["km000500","SOLD","Family Residential",16,"Firth Crescent",389900,null,"Delightful 1860 sq ft Bungalow Nestled on a Tree Lined Street & Backing on to The Curran Hall Park & Ravine",null,"SCAR. GLF CLB/BRIMORTON"," 43°46'1.97\"N"," 79°12'42.21\"W",{"$f":"IF(ISBLANK(K440),\"\",DMS_to_Dec(K440))","v":43.76721388888889},{"$f":"IF(ISBLANK(L440),\"\",DMS_to_Dec(L440))","v":-79.211725000000001},"http://www.karenmillar.com/spotlight_slideshow.php?id=km000500",null,null,null," 40 x 116.25 ft, 57' rear width (Ravine)"," $2,278.31/2013"," 2 + 1"," Carport + 2 car parking"," 2 x 4 Piece",null,null," Aug 12 2013"," George B Little PS"," George B Little PS"," Woburn CI"," Hardwood Flooring Re-Finished 2011"," Freshly Painted Main Level 2011","Super Sized Backyard"," Stunning Views of the Parkland from Living Room & Dining Room"," Lower Level Family Room with Walkout to Backyard & Ravine"," Side Yard with Wooden Deck Overlooking Backyard & Ravine"," Close to Schools, Shops, Parks, Ravine, Ttc & 401"," Super Spacious Lower Level with Separate Entrance, Kitchen & Bath"," In-Law Potential"]
["km000501","SOLD","Family Residential",8,"Redwing Place",499900,null," First Time Buyer's Alert! "," Rare 2-Storey Semi-Detached Home on a Lovely Family Friendly Cul-de-Sac","DON MILLS/LAWRENCE"," 43°43'40.61\"N"," 79°20'32.64\"W",{"$f":"IF(ISBLANK(K441),\"\",DMS_to_Dec(K441))","v":43.727947222222227},-79.342399999999998,"http://www.karenmillar.com/spotlight_slideshow.php?id=km000501",null,null,null," 50.16 x 132.95 ft"," $3,488.32/2013",3," 3 Car Parking"," 1 x 4, 1 x 2, 1 x 1 Piece",null,null," September 12, 2013 or tba"," Greenland PS/Norman Ingram PS"," Don Mills MS"," Don Mills CI"," Furnace Approx 4 Years Old"," Roof Approx. 5 Years Old"," 100 Amp Service"," In Your Neighbourhood :"," Shops at Don Mills"," St. Bonaventure Catholic School"," Greenland Public School"," Norman Ingram Public School"," Don Mills Middle School"," Don Mills Collegiate"," Don Mills Public Library"," Civitan Don Mills Arena"," Donalda Club"," Bond Park"," Don Mills Tennis Club"]
["km000502","SOLD","Family Residential",23,"Slidell Crescent",584700,null," Loaded with Potential!"," Super Family Home Right Across from Fenside Park!","YORK MILLS/DON MILLS"," 43°45'48.66\"N"," 79°19'39.34\"W",43.763516666666668,-79.327594444444443,"http://www.karenmillar.com/spotlight_slideshow.php?id=km000502",null,null,null," 52.15 x 123.12 ft"," $4,042.05/2013"," 3 + 1"," 2 car parking"," 2 x 4 Piece",null,null," Immediate or TBA"," Fenside PS"," Donview MS"," George S Henry Academy"," In Your Neighbourhood:"," Fenside Public School"," Donview Middle School"," George S. Henry Academy"," DVP, HWY 401 & 404"," Ttc (Fenside and/or York Mills Bus)"," Fenside Arena, Baseball Park & Tennis Courts"," Parkway Mall"," Parkwoods Plaza"," Fairview Mall"," Shops at Don Mills"]
["km000503","SOLD","Executive",9,"Butterfield Drive",1188800,null," Remarkable Renovated Tudor Executive 2-Storey Home on One of Don Mills' Most Sought After Streets",null,"LAWRENCE/UNDERHILL"," 43°44'58.02\"N"," 79°19'18.60\"W",43.749450000000003,-79.321833333333331,"http://www.karenmillar.com/spotlight_slideshow.php?id=km000503",null,null,null," 50 x 120 Ft."," $5,399.34/2013",4," Double Car Garage + 2 Car Parking"," 1 x 5, 1 x 4, 1 x 3, 1 x 2 Piece",null,null," 60 Days or TBA"," Ranchdale PS"," Milne Valley MS"," Victoria Park CI"," Extensively Renovated"," Newer Kitchen","Newer Bathrooms"," Newer Flooring"," Irrigation System In Front & Back"," Backyard Landscaped `13"," Furnace `00"," Central Air Conditioning `00"," Roof 5yrs"," Casement Windows 5yrs"," Eavestroughs & Soffit 5yrs"," In-Ground Swimming Pool"," Pool Liner 6ys"," Newer Pool Heater & Equipment"]
["km000504","SOLD","Condo",16,"Dallimore Circle, Suite 613",344900,null,"Super Low-Rise & Sun-Filled 2 Bedroom + Den"," Steps to the Don Valley Trail & Minutes to the Shops at Don Mills","DON MILLS/LAWRENCE"," 43°43'52.02\"N"," 79°20'3.67\"W",43.731116666666665,-79.334352777777767,"http://www.karenmillar.com/spotlight_slideshow.php?id=km000504",null,null,null,null," $1,627.63/2012",2," 1 Car Parking (B-44)"," 1 x 4, 1 x 3 Piece"," $574.49/mo includes heat, air conditioning, parking, building insurance & common elements"," 1 (B-102)"," August 14, 2013 or tba"," Greenland PS/Norman Ingram PS"," Don Mills MS"," Don Mills CI"," Open Concept"," Amazing Treetop Ravine Views"," 2 Walkouts to Open Balcony"," Stainless Steel Appliances"," Stacked Washer & Dryer"," Amenities:"," On-Site Concierge/Security"," Guest Suite"," Sauna"," Exercise Room"," Party/Meeting Room with Outdoor Patio"," Visitor Parking"]
["km000505","ARCHIVE","Condo",85,"The Donway West, Suite 606",319000,null,"Brand New Reflections Residences at The Shops at Don Mills","Be One of the First to Experience this New Urban Village","DON MILLS/LAWRENCE"," 43°43'58.04\"N"," 79°20'46.17\"W",{"$f":"IF(ISBLANK(K445),\"\",DMS_to_Dec(K445))","v":43.732788888888891},-79.346158333333335,"http://www.karenmillar.com/spotlight_slideshow.php?id=km000505",null,null,null,null,0,"1 + 1"," 1 Underground Parking Spot"," 1 x 4 Piece",0,null," Immediate or TBA"," Greenland PS/Norman Ingram PS"," Don Mills MS"," Don Mills CI"," Thousands In Upgrades"," 657 sq. ft. with 108 sq. ft. Balcony"," Luxury Boutique Condo Residence in the Heart of Don Mills","  Stainless Steel Appliances","  Laminate Flooring","  Granite Countertops","  Double Undermount Sink","  Walk-In Closet","  Capped Ceiling Outlets in Kitchen, Living Room & Bedroom","  2 Sliding Door Walkouts to Balcony","  Southern Views of Toronto Skyline","  Stacked Washer & Dryer"," Steps to Shops at Don Mills, Restaurants & The Metro","  Amenities: Exercise & Party Room"]
["km000506","SOLD","Family Residential",93,"Cornerbrook Drive",499900,null," Super Lovely Ravine Property","Amazing Opportunity to Move into a Wonderful Neighbourhood","DON MILLS/LAWRENCE"," 43°44'38.29\"N"," 79°19'52.62\"W",43.743969444444446,-79.331283333333332,null,null,null,null," 36 x 182 feet"," "," 3 + 1"," Carport + 4 Car Parking"," 1 x 4, 1 x 3 Piece",null,null," 30 Days or TBA"," Cassandra PS"," Milne Valley MS"," Victoria Park CI"]
["km000507","SOLD","Family Residential","34","Laurentide Drive",788800,null," A Donalda Charmer! Beautifully Updated with New Kitchen!"," Minutes to Walking Trails, Schools, Parks, Ttc, Ravines, Dvp & 401","DON MILLS/YORK MILLS"," 43°45'10.65\"N"," 79°20'14.53\"W",43.752958333333332,-79.337369444444434,"http://www.karenmillar.com/spotlight_slideshow.php?id=km000507",null,null,null," 55 x 119 ft."," $4,864.25/2013"," 3 + 1"," Single car garage + 3 car parking"," 2 x 4 Piece",null,null," 60 Days or TBA"," Three Valleys PS"," Milne Valley MS"," George S Henry Academy","High Efficiency Furnace '08"," 100 Amp Service"," Roof '08"," Fascia & Soffits '08"," Sauna '04"," Driveway '12"," Newer Kitchen"," Kitchen Backsplash '13"," Renovated Entry"," New Doors on Main Level"," Re-Finished Hardwood Flooring on Main Level"]
["km000508","SOLD","Family Residential","74","Ranchdale Crescent",888800,null," Spacious Family Home in a Sought After Neighbourhood",null,"LAWRENCE/UNDERHILL"," 43°45'10.56\"N"," 79°19'19.27\"W",{"$f":"IF(ISBLANK(K448),\"\",DMS_to_Dec(K448))","v":43.752933333333331},{"$f":"IF(ISBLANK(L448),\"\",DMS_to_Dec(L448))","v":-79.322019444444436},"http://www.karenmillar.com/spotlight_slideshow.php?id=km000508",null,null,null," 50 x 120 ft."," $4,564.08/2013",4," Double Car Garage + 4 Car Parking"," 1 x4, 1 x 3, 1 x 2 Piece",null,null," 30 Days or tba"," Ranchdale PS"," Milne Valley MS"," Victoria Park CI"," Furnace 2011"," Roof 2005"," Central Air Conditioning 2009"," 200 Amp Service"," Heated In-Ground Swimming Pool"," Pool Liner Approx. 2008"]
["km000509","SOLD","Condo","5","Marine Parade Drive, 527",328800,null,"Grenadier Landing! Lakefront Living at It's Finest!"," Super Suite with Panoramic Views of Lake and Overlooking a Quiet Courtyard","PALACE PIER/LAKESHORE"," 43°37'46.53\"N"," 79°28'32.35\"W",{"$f":"IF(ISBLANK(K449),\"\",DMS_to_Dec(K449))","v":43.62959166666667},{"$f":"IF(ISBLANK(L449),\"\",DMS_to_Dec(L449))","v":-79.475652777777782},"http://www.karenmillar.com/spotlight_slideshow.php?id=km000509",null,null,null,null," $2,009.85/2013"," 1 + 1"," 1 parking spot (p3-57)"," 1 x 4, 1 x 3 Piece"," $497.00/mo includes heat, water, hydro, central air conditioning, parking, common elements & building insurance"," 1 A28"," 60 days or tba",null,null,null,"Two-Storey Residence Overlooking Parkland and Lake Ontario","Two-Storey Grand Lobby with Access to Landscaped Courtyard","Steps to Bicycle Paths Linking to Martin Goodman Trail & The Ontario Greenway Waterfront Trail","9 ft Ceilings","2 Walkouts to Balcony","24-Hour Concierge","Amenities:","Party Room","Hobby/Craft Room","Games Room with Ping Pong & Billiards","Media Room","Exercise Room","Visitor Parking","2 Guest Suites with Balcony","Landscaped Courtyard with BBQ","Rooftop patio","Convenient Store & Cleaners"]
["km000510","SOLD","Family Residential",103,"Laurentide Drive",null,2500," Demand Donalda Neighbourhood! "," Across From Laurentide Park!","YORK MILLS/DVP"," 43°45'20.16\"N"," 79°20'14.71\"W",{"$f":"IF(ISBLANK(K450),\"\",DMS_to_Dec(K450))","v":43.755600000000001},{"$f":"IF(ISBLANK(L450),\"\",DMS_to_Dec(L450))","v":-79.337419444444436},"http://www.karenmillar.com/spotlight_slideshow.php?id=km000510",null,null,null," 161 x 153 ft",null,3," 2 Car Garage + 8 Car Parking"," 2 x 4 Piece",null,null," Immediate or TBA"," Three Valleys PS"," Milne Valley MS"," George S Henry Academy"," Hardwood Flooring"," Pet Friendly"," Breakfast Area","Central Air Conditioning"," 4 Piece Ensuite Bathroom"," Main Floor Laundry"," New Fridge"," New Stove"," New Built-in Dishwasher"," Family Sized Backyard with Wooden Deck"]
["km000511","SOLD","Family Residential","40","Crossburn Drive",848000,null,"Land Value! Ravine Lot on Demand Street in Donalda Club Neighbourhood",null,"DON MILLS/LAWRENCE"," 43°44'37.16\"N"," 79°20'31.44\"W",{"$f":"IF(ISBLANK(K451),\"\",DMS_to_Dec(K451))","v":43.743655555555556},{"$f":"IF(ISBLANK(L451),\"\",DMS_to_Dec(L451))","v":-79.342066666666668},"http://www.karenmillar.com/spotlight_slideshow.php?id=km000511",null,null,null," 50 x 233 ft"," $4,448.49/2013"," 3 + 2"," 1 Car Parking "," 1 x 5, 1 x 4 Piece",null,null," December 2013 or TBA"," Greenland PS */ Norman Ingram PS  "," Don Mills MS"," Don Mills CI"," In-ground Swimming Pool","Walk-out to Deck from Kitchen"," Sunken Dining Room"," "]
["km000512","SOLD","Family Residential","31","Moccasin Trail",null,2000,"Private Ravine-Like Garden on Quiet Cul-de-Sac"," Steps to Schools, Ttc, Dvp/401 & Shops at Don Mills","DON MILLS/LAWRENCE"," 43°43'54.08\"N"," 79°20'15.80\"W",{"$f":"IF(ISBLANK(K452),\"\",DMS_to_Dec(K452))","v":43.73168888888889},{"$f":"IF(ISBLANK(L452),\"\",DMS_to_Dec(L452))","v":-79.337722222222212},"http://www.karenmillar.com/spotlight_slideshow.php?id=km000512",null,null,null," 23.7 x 134.11 ft (irregular) "," ",3," 4 Car Parking"," 1 x 4, 1 x 2 Piece",null,null," Immediate or tba"," Greenland PS/Norman Ingram PS"," Don Mills MS"," Don Mills CI"," Parquet Flooring"," Newer Roof"," 100 Amp Circuit Breakers"," Family Sized Kitchen"," Sliding Door Walkout to Patio"]
["km000513","SOLD","Family Residential","16","Hatherton Crescent",798800,null,"Fabulous Family Home on One of Don Mills' Most Sought After Streets!"," Beautifully Maintained 4 Bedroom Home!","LAWRENCE/UNDERHILL"," 43°44'58.09\"N"," 79°19'30.33\"W",43.749469444444443,-79.325091666666665,"http://www.karenmillar.com/spotlight_slideshow.php?id=km000513",null,null,null," 57 x 117.08 feet"," $4,372.05/2013",4," Double Car Garage + 4 Car Parking"," 1 x 4, 1 x 3, 1 x 2 Piece",null,null,"30 days or tba"," Ranchdale PS"," Milne Valley MS"," Victoria Park CI"," Roof 2006"," Furnace 2000","Family Size Backyard"," Wood-burning Fireplace with Fieldstone Surround"," Family Room Sliding Door Walkout to Backyard"]
["km000514","SOLD","Family Residential","1068","Riverview Crescent",535500,null,"Fabulous 4 Bedroom Family Home!","Minutes to Rouge Valley Park","ALTONA/KINGSTON RD"," 43°48'39.34\"N"," 79° 8'5.26\"W",43.810927777777778,-79.134794444444452,"http://www.karenmillar.com/spotlight_slideshow.php?id=km000514",null,null,null," 40.03 x 109.91 ft"," $5,490.58/2013",4," Double Car Garage + 2 Car Parking"," 2 x 4, 1 x 3, 1 x 2 Piece",null,null," Immediate or TBA","Elizabeth B. Phin P.S","Elizabeth B. Phin M.S"," Dunbarton H.S"," Newer Roof"," Newer Furnace"," Updated Windows"," Central Air Conditioning"," 100 Amp Service"," Hardwood Flooring '12"," Hot Tub '12"," Cedar Deck '13"," In-Ground Gunite Swimming Pool"," Central Vacuum","Intercom System"]
["km000515","SOLD","Family Residential","21","Redwillow Drive",848800,null,"What a Gem! Beautiful Hardwood Floors Throughout"," Gorgeous Built-ins in the Family Room & Rec Room","LAWRENCE/UNDERHILL"," 43°44'47.88\"N"," 79°19'43.03\"W",43.746633333333335,-79.328619444444442,"http://www.karenmillar.com/spotlight_slideshow.php?id=km000515",null,null,null," 55 x 110 Feet."," $4,694.59/2013"," 3 + 2"," Double car garage + 2 car parking"," 1 x 4, 1 x 3, 1 x 2 Piece",null,null," Immediate or TBA"," Cassandra PS"," Milne Valley MS"," Victoria Park CI"," Roof 2003"," Hi Efficiency Furnace 2012"," Updated Windows"," Energy Efficient Central Air Conditioning 2012"," 100 Amp Service"]
["km000516","SOLD","Executive","49","Larabee Crescent",1088800,null,"Stunning & Spacious Four Level Side-split Backing on to Laurentide Park in the Prestigious and Sought After Neighbourhood of the Donalda Golf & Country Club",null,"YORK MILLS/DON MILLS"," 43°45'16.97\"N"," 79°20'11.14\"W",43.754713888888887,-79.336427777777772,"http://www.karenmillar.com/spotlight_slideshow.php?id=km000516",null,null,null," 60 x 110 ft."," $5,432.90/2013",4," Double car garage + 4 car parking"," 1 x 5, 1 x 3, 1 x 2 Piece",null,null," November 2013 or tba"," Three Valleys PS"," Milne Valley MS"," George S Henry Academy","Roof  ’98","Furnace ’07 ","Air Conditioning ’07","100 Amp Service ","Hardwood Flooring in Living and Dining Aug ‘13","Window in Upper Bedrooms Aug’13","Window in Upper Bedrooms Aug’13","Windows in Living, Dining and Master Bedroom '11 ","Stainless Steel Dishwasher ’13 ","Updated Bathrooms ","Updated Kitchen ","Gas Fireplace with Marble Surround and Custom Wood Mantle ","BBQ Gas Hook Up "]
["km000517","SOLD","Family Residential","21","Averdon Crescent",898800,null," Spacious Family Home in a Sought After Neighbourhood"," Over 2500 sq. ft!","LAWRENCE/UNDERHILL"," 43°44'56.36\"N"," 79°19'26.21\"W",{"$f":"IF(ISBLANK(K457),\"\",DMS_to_Dec(K457))","v":43.748988888888888},{"$f":"IF(ISBLANK(L457),\"\",DMS_to_Dec(L457))","v":-79.323947222222216},"http://www.karenmillar.com/spotlight_slideshow.php?id=km000517",null,null,null," 63 x 107.58 ft."," $4,925.78/2013",4," Double Car Garage + 2 Car Parking"," 2 x 4, 2 x 2 Piece",null,null," 30 days or TBA"," Ranchdale PS"," Milne Valley MS"," Victoria Park CI"," Central Vacuum"," 2-Tiered Wooden Deck "," Hardwood Flooring"," Family Sized Kitchen with Sliding Door Walk-out to Deck"," Family Room Addition"," 3 Skylights"," Private Fully Fenced Backyard"]
["km000518","SOLD","Family Residential","175","Cassandra Boulevard",848800,null,"What a Gem! Super Family Home with 4 Season Solarium Overlooking Landscaped Garden & Pool!",null,"LAWRENCE/UNDERHILL"," 43°45'12.14\"N"," 79°19'25.69\"W",{"$f":"IF(ISBLANK(K458),\"\",DMS_to_Dec(K458))","v":43.753372222222225},{"$f":"IF(ISBLANK(L458),\"\",DMS_to_Dec(L458))","v":-79.323802777777772},"http://www.karenmillar.com/spotlight_slideshow.php?id=km000518",null,null,null," 55 x 120 ft."," $4,724.42/2013",4," Double Car Garage + 2 Car Parking"," 1 x 4, 1 x 3, 1 x 2 Piece & 1 x 2 Piece Roughed-in",null,null," 60 days or tba"," Ranchdale PS"," Milne Valley MS"," Victoria Park CI"," Four Seasons Sunroom with Lifetime Warranty ‘12"," Updated Windows"," 100 Amp Service"," Central Air Conditioning"," Central Vacuum"," Lots of Storage Space"," 2 Sliding Door Walk-outs to Backyard Oasis"," Hardwood Flooring"," Gunite In-Ground Swimming Pool"," Close to Schools, Parks, Dvp & 401"]
["km000519","SOLD","Family Residential","109","Hazelton Avenue",1699990,null," Live in the Heart of Yorkville!"," Steps to Amazing Entertainment, Excellent Shopping & Convenient Transportation!","AVENUE RD/DAVENPORT"," 43°40'26.54\"N"," 79°23'39.99\"W",{"$f":"IF(ISBLANK(K459),\"\",DMS_to_Dec(K459))","v":43.674038888888887},{"$f":"IF(ISBLANK(L459),\"\",DMS_to_Dec(L459))","v":-79.39444166666668},"http://www.karenmillar.com/spotlight_slideshow.php?id=km000519",null,null,null," 25 x 75 ft."," $11,615.29/2013",3," 1 x 5, 1 x 4, 2 x 2 Piece"," 2 car parking",null,null," Immediate or tba","Jesse Ketchum Jr & Sr PS","Jesse Ketchum Jr & Sr PS","Jarvis CI"," Multi-Level Freehold Townhome"," Freshly Painted"," Central Vacuum"," Close to Shops, Restaurants, Parks, Schools, Transit & Entertainment"," 97 Walk Score & 98 Transit Score"," Hazelton Lanes Shopping Centre"," Pusateri's Fine Food"," Whole Foods"," Holt Renfrew"," Four Seasons Hotel"," Heliconian Club"," The Hazelton Hotel"," Park Hyatt Toronto"," Royal Ontario Museum"]
["km000520","SOLD","Family Residential","28","Scarcliff Gardens",579900,null,"Guildwood Village Gem!","Country Living in the City! Beautifully Updated Side-Split Family Home","MORNINGSIDE/GUILDWOOD"," 43°45'11.19\"N"," 79°11'2.21\"W",43.75310833333333,-79.18394722222223,"http://www.karenmillar.com/spotlight_slideshow.php?id=km000520",null,null,null," 50 x 164.89 ft."," $2,807.81/2013",4," Single Car Garage + 2 Car Parking"," 1 x 5, 1 x 3 Piece",null,null," 60 days or tba"," Poplar Road Jr PS"," Jack Miner Sr PS"," Sir Wilfrid Laurier CI"," Furnace ‘09"," Windows ‘08"," Kitchen ‘08"," 5 Piece Bathroom ‘08"," 3 Piece Ensuite Shower ’12 "," Wooden Deck '12"," Wooden Front Porch '12"," 125 Amp Service"]
["km000521","SOLD","Family Residential","48","Camwood Crescent",818800,null," Spacious Side-Split with Main Floor Family Room!"," Huge Lot in the Sought After Donalda/Parkwoods Neighbourhood","YORK MILLS/DON MILLS"," 43°45'39.71\"N"," 79°20'19.42\"W",{"$f":"IF(ISBLANK(K461),\"\",DMS_to_Dec(K461))","v":43.761030555555557},{"$f":"IF(ISBLANK(L461),\"\",DMS_to_Dec(L461))","v":-79.338727777777777},"http://www.karenmillar.com/spotlight_slideshow.php?id=km000521",null,null,null," 37.45 x 177.21 ft. Rear: 125.83' East: 111.54"," $5233.41/2013",4," Single Car Garage + 3 Car Parking","2 x 4, 1 x 2 Piece",null,null," December 2013 or TBA"," Rene Gordon HWA"," Donview MHWA"," George S Henry Academy"," High Efficiency Furnace ’07 "," High Efficiency Air Conditioning ’07 "," Roof ‘05"," 100 Amp Service "," Upper Level Bathroom, Master Bedroom, Ensuite & Lower Level Bedroom Windows ‘13"," Driveway and Interlocking Walkway ‘03"]
["km000522","SOLD","Condo","1200","Don Mills Road, Suite 104",469900,null,"Wonderful Ground Floor Garden View Model","Rare Approx. 1453 S.F. With Split Bedroom Design","DON MILLS/LAWRENCE"," 43°44'23.94\"N"," 79°20'39.63\"W",{"$f":"IF(ISBLANK(K462),\"\",DMS_to_Dec(K462))","v":43.739983333333335},{"$f":"IF(ISBLANK(L462),\"\",DMS_to_Dec(L462))","v":-79.344341666666665},"http://www.karenmillar.com/spotlight_slideshow.php?id=km000522",null,null,null,null," $3,266.45/2013",2," 1 car parking"," 2 x 4 Piece"," $888.45/mo includes: water, heat, hydro, cable, central air conditioning, parking, building insurance and common elements",1," 30 - 60 days or tba"," Greenland PS */Norman Ingram PS"," Don Mills MS"," Don Mills CI"," 2 Sliding Door Walk-outs to Terrace"," Spacious Living & Dining Room"," Super Parking Spot Location"," Huge Locker with Shelving"," Amazing Location"]
["km000523","SOLD","Executive","12","Sandpiper Court",1988800,null," This Home Has Been Designed with a Carefully Chosen Portfolio of Natural Materials to Provide an Aesthetically Pleasing Exterior That is in Perfect Harmony with the Neighborhood and Virtually Maintenance-Free for the Owner. ","Brand New Barbini Built Home in the Heart of the Donalda","YORK MILLS/LAWRENCE"," 43°45'17.26\"N"," 79°20'18.46\"W",{"$f":"IF(ISBLANK(K463),\"\",DMS_to_Dec(K463))","v":43.754794444444443},{"$f":"IF(ISBLANK(L463),\"\",DMS_to_Dec(L463))","v":-79.338461111111101},"http://www.karenmillar.com/spotlight_slideshow.php?id=km000523",null,null,null," 54 x 135.41 ft. (Rear 194 ft. Backing on to Park-Land)"," $6,186.12/2013","3+2"," Double car garage + 4 car parking","2 x 4, 1 x 3, 1 x 2 Piece",null,null,"Immediate/TBA"," Three Valleys PS"," Milne Valley MS"," George S Henry Academy"," Energy Star Labeled Integrated Hydronic Air Handler HRV with ECM Motor"," Energy Star Labeled 14.5 SEER Three-Ton Keeprite Air-Conditioner"," Honeywell HE 300 Humidifier"," Premium Honeywell Media Air Cleaner"," Honeywell Process Thousand Wi-Fi Programmable Thermostat"," Backs on to Private-Like Laurentide Park"," Bamboo Flooring on Main Level"," High Baseboards Throughout"," Whole House Multi-Room Audio System"," 200 Amp Service"," Dashwood LowE Windows"," Spectacular Backyard Oasis"," Central Vacuum System"," Paradox Panel"," Future-Ready Modern Technology for Data, Voice, Cable & Automation"]
["km000524","SOLD","Family Residential","71","Frater Avenue",459900,null,"Affordable & Adorable! Lovely 2 Storey Detached Home on Wonderful Lot",null,"WOODBINE/SAMMON"," 43°41'28.83\"N"," 79°19'2.30\"W",{"$f":"IF(ISBLANK(K464),\"\",DMS_to_Dec(K464))","v":43.691341666666666},{"$f":"IF(ISBLANK(L464),\"\",DMS_to_Dec(L464))","v":-79.317305555555549},"http://www.karenmillar.com/spotlight_slideshow.php?id=km000524",null,null,null," 18.79 x 103 ft."," $2,904.76/2013",2," 1 car parking pad"," 1 x 4, 1 x 2 Piece",null,null," January 2014 or tba"," RH McGregor ES"," Cosburn MS"," East York CI"," Furnace 2009"," 100 Amp Service"," Air Conditioning"," Updated Pex Hot & Cold Lines"," Concrete Legal Parking Pad Repaved 2012"," 95 Walkscore"," Tank-less Water Heater",null,null,null,"In Your Neighbourhood:"," Steps to Woodbine Station"," Danforth Avenue"," Restaurants & Boutiques"," Toronto East General Hospital & Clinic"," Parks & Green-Spaces"," RH McGregor ES (French Immersion also)"," Cosburn MS"," Danforth C & TI"]
["km000525","SOLD","Family Residential","436","Huntingwood Drive",599900,null,"What a Charmer! Updated 4 Bedroom Home Across from Huntingwood Park!",null,"PHARMACY/HUNTINGWOOD"," 43°46'59.87\"N"," 79°19'3.51\"W",{"$f":"IF(ISBLANK(K465),\"\",DMS_to_Dec(K465))","v":43.783297222222224},{"$f":"IF(ISBLANK(L465),\"\",DMS_to_Dec(L465))","v":-79.31764166666666},"http://www.karenmillar.com/spotlight_slideshow.php?id=km000525",null,null,null," 45 x 120 Feet"," $3,240.35/2013",4," Single car garage + 2 car parking"," 1 x 4, 1 x 2 Piece",null,null," Immediate or TBA"," Bridlewood Jr PS"," JB Tyrrell Sr PS"," Sir John A Macdonald CI/"," Central Air Conditioner’12"," Furnace’12"," 100 Amp Service"," Roof Approximately 10 Years Old"," Extra Attic Insulation"," Updated Kitchen, Bathrooms & Windows"," Updated Soffits & Fascia"]
["km000526","SOLD","Family Residential","15","Pinemore Crescent",499900,null,"Super Spacious Semi with Updated Lower Level In-Law Suite!",null,"ELLESMERE/VICTORIA PARK"," 43°45'25.39\"N"," 79°19'1.32\"W",{"$f":"IF(ISBLANK(K466),\"\",DMS_to_Dec(K466))","v":43.75705277777778},{"$f":"IF(ISBLANK(L466),\"\",DMS_to_Dec(L466))","v":-79.317033333333328},"http://www.karenmillar.com/spotlight_slideshow.php?id=km000526",null,null,null," 39 x 102 Feet"," $2,977.47/2013"," 3 + 1"," Single car garage + 2 car parking"," 1x4, 1x3 Piece",null,null," February 2014/TBA"," Ranchdale PS"," Donview MHWA"," Victoria Park CI"," Roof ‘12"," 100 Amp Service ’03"," Furnace & Air Conditioner ’95"," New Kitchen with Custom Cabinetry ’03"," New Bathrooms ’05 & ‘01"," New Trim Throughout"," Hardwood Flooring","In-Law Suite"]
["km000527","SOLD","Family Residential","28","Kellythorne Drive",898800,null," Rare, Rare, Rare! "," Spacious Bungalow with Walkout Lower Level","LAWRENCE/UNDERHILL"," 43°45'6.73\"N"," 79°19'38.55\"W",{"$f":"IF(ISBLANK(K467),\"\",DMS_to_Dec(K467))","v":43.751869444444445},{"$f":"IF(ISBLANK(L467),\"\",DMS_to_Dec(L467))","v":-79.327374999999989},"http://www.karenmillar.com/spotlight_slideshow.php?id=km000527",null,null,null," 63 x 129.25 ft."," $4,651.71/2013"," 3 + 1"," Double Car Garage + 2 Car Parking"," 1 x 4, 1 x 3, 1 x 2 Piece",null,null," January 17, 2014 or tba"," Cassandra PS"," Milne Valley MS"," Victoria Park CI"," High Efficiency Furnace '08"," Central Air Conditioning System '05 "," Beam Central Vacuum"," Roof ’09"," 100 Amp Circuit Breakers"," New Rheem 50 Gallon Energy Star Water Heater"]
["km000528","SOLD","Family Residential","22","Hopecrest Crescent",498900,null,"Spectacular ravine lot!  Super private cul-de-sac!","Renovated kitchen and baths, updated windows","KENNEDY/EGLINTON"," 43°43'30.45\"N"," 79°16'0.64\"W",{"$f":"IF(ISBLANK(K468),\"\",DMS_to_Dec(K468))","v":43.725124999999998},{"$f":"IF(ISBLANK(L468),\"\",DMS_to_Dec(L468))","v":-79.266844444444445},"http://www.karenmillar.com/spotlight_slideshow.php?id=km000528",null,null,null," 50.25 x 190.03 ft."," $2,649.33/2013"," 3 + 1"," Single car garage + 2 parking"," 1 x 4, 1 x 3 Piece",null,null," March 2014 or tba"," Corvette Jr PS"," Robert Service Sr PS"," Winston Churchill CI"," Updated Kitchen"," Updated Bathrooms"," Large Ravine Lot"," Updated Windows"," Farlinger Circle Park"," Eglinton Ravine Park"," Scarborough Centre for Alternative Studies"," Scarborough GO Station Rail"," Kennedy Subway Station"," Kennedy GO Station Rail"," Corvette PlazaTim Horton's"]
["km000529","SOLD","Executive","55","Fairmeadow Avenue",1998800,null,"Traditional, Elegant & Gracious Residence in the Sought-After Yonge & York Mills Neighbourhood",null,"BAYVIEW/YORK MILLS"," 43°45'25.88\"N"," 79°23'55.76\"W",{"$f":"IF(ISBLANK(K469),\"\",DMS_to_Dec(K469))","v":43.757188888888891},{"$f":"IF(ISBLANK(L469),\"\",DMS_to_Dec(L469))","v":-79.398822222222222},"http://www.karenmillar.com/spotlight_slideshow.php?id=km000529",null,null,null," 60 x 125 ft"," $12,554.96/2013"," 5 + 2"," 2 Car Garage + 4 Car Parking"," 1 x 6, 4 x 4, 1 x 2 Piece ",null,null," 30 - 60 days or tba"," Owen PS"," St. Andrew's JHS"," York Mills CI","  Fully Wired Intercom System"," Two Video Surveillance Telephones to Front Door"," Central Air Conditioning ‘09 "," Underground Sprinkler System"," 200 Amps Circuit Breakers"," Central Vacuum"," High Efficiency Gas Furnace ‘09",null," All New Door Frames & Baseboards on Main Level"," High Ceilings Throughout"]
["km000530","SOLD","Condo","5","Concorde Place #3011",319700,null,"Magnificent Unobstructed Views of Ravine!","Spacious 2 Bedroom Plus Solarium in Move-In Condition!","DVP/WYNFORD"," 43°43'47.39\"N"," 79°19'39.66\"W",{"$f":"IF(ISBLANK(K470),\"\",DMS_to_Dec(K470))","v":43.729830555555559},{"$f":"IF(ISBLANK(L470),\"\",DMS_to_Dec(L470))","v":-79.327683333333326},"http://www.karenmillar.com/spotlight_slideshow.php?id=km000530",null,null,null,null," $1,996.79/2013"," 2 + 1"," 2 car parking"," 1 x 4, 1 x 3 Piece","$573.39/mo includes hydro, parking, common elements & building insurance",null," February 2014 or tba"," Gateway PS"," Valley Park MS"," Marc Garneau CI/Don Mills CI"," Stainless Steel Appliances"," Wonderful Amenities"," Panoramic Views of Ravine"," Minutes to Loblaws Super Store, Shops at Don Mills, Wynford Market & Walking Trails"," Ttc at Your Doorstep"," Express Bus to Downtown"," Twenty Minutes to Downtown"]
["km000531","SOLD","Condo","55","Scollard Street #2002",1498800,null," Prestigious & Spacious Yorkville Condo!","Luxury Lives Here! Steps to Shopping & Fine Dining","SCOLLARD/YORKVILLE"," 43°40'19.45\"N"," 79°23'19.13\"W",{"$f":"IF(ISBLANK(K471),\"\",DMS_to_Dec(K471))","v":43.672069444444439},{"$f":"IF(ISBLANK(L471),\"\",DMS_to_Dec(L471))","v":-79.388647222222232},"http://www.karenmillar.com/spotlight_slideshow.php?id=km000531",null,null,null,null," $14,168.79/2013",2," 1 Underground spot P5 34 (right out of P5 entrance from east tower)"," 1x6, 1x3, 1x2 Piece"," $1,268.25/mo (includes water, common elements, building insurance & parking)"," 14E"," April 2014/TBA","Jesse Ketchum Jr & Sr PS","Jesse Ketchum Jr & Sr PS","Jarvis CI"," Unobstructed Panoramic Views From All Rooms"," Ten Foot Ceilings Throughout"," Hardwood and Marble Flooring Throughout"," Access to Four Seasons Hotel"," Gas fireplace"," Amenities: "," Concierge"," Visitor Parking"," Access to Four Seasons Gym, Indoor Pool & Party Room"]
["km000532","SOLD","Family Residential","193","Three Valleys Drive",588800,null,"Beautifully Renovated Throughout!","Located Across from Donalda Golf Course!","YORK MILLS/DON MILLS"," 43°44'41.54\"N"," 79°20'13.79\"W",{"$f":"IF(ISBLANK(K472),\"\",DMS_to_Dec(K472))","v":43.74487222222222},{"$f":"IF(ISBLANK(L472),\"\",DMS_to_Dec(L472))","v":-79.337163888888881},"http://www.karenmillar.com/spotlight_slideshow.php?id=km000532",null,null,null," 36 x 110 ft"," $2,964.42/2013",3," Single car garage + 4 car"," 1 x 4, 1 x 3 Piece",null,null," 30-60 days or tba","Three Valleys PS","Milne Valley MS","George S Henry Academy","Garage Roof ‘13","Window Coverings Throughout ‘13","Interior Doors and Hardware throughout ‘11 & ‘13","4 Piece Bathroom on Upper Level ‘12","Living Room Ceiling and Pot Lights ‘12","Finished Lower Level ’11","Owned Tank-Less Water Heater ‘11","High-Efficiency Furnace with Air Cleaner ‘11","Fenced Dog Run ‘11","Air Conditioner ‘10"]
["km000533","SOLD","Family Residential","8","Hirondelle Place",748800,null,"Renovate or Build! This Spacious Sidesplit is on a Wonderful Lot on a Sought After Cul-de-Sac Surrounded by Ravines, Greenbelts, Schools, Shops, DVP/401 & TTC only Steps Away",null,"LAWRENCE/UNDERHILL"," 43°45'13.10\"N"," 79°19'35.46\"W",{"$f":"IF(ISBLANK(K473),\"\",DMS_to_Dec(K473))","v":43.753638888888887},{"$f":"IF(ISBLANK(L473),\"\",DMS_to_Dec(L473))","v":-79.326516666666663},"http://www.karenmillar.com/spotlight_slideshow.php?id=km000533",null,null,null,"50 x 156.75 ft (west side), 130.45 ft (east side), 81 + 33 ft. (rear)"," $4,700.19/2013",3," Single car garage + 3 car parking"," 1 x 4, 1 x 3 Piece",null,null," 30 days or tba","Ranchdale PS","Milne Valley MS","Victoria Park CI"]
["km000534","SOLD","Condo","1048","Broadview Avenue, #1604",349900,null,"Prestigious Minto Skyy Condo","Amazing South-East Skyline Views","BROADVIEW/DANFORTH"," 43°41'4.25\"N"," 79°21'24.83\"W",{"$f":"IF(ISBLANK(K474),\"\",DMS_to_Dec(K474))","v":43.684513888888887},{"$f":"IF(ISBLANK(L474),\"\",DMS_to_Dec(L474))","v":-79.356897222222216},"http://www.karenmillar.com/spotlight_slideshow.php?id=km000534",null,null,null,null," $1,709.67/2013",1," Single Car Parking"," 1 x 4 Piece"," $342.22/mo includes hydro, cable tv, central air conditiioning, parking, common elements & building insurance",1," February 2014 or tba"," Chester ES"," Westwood MS"," East York CI"," Engineered Flooring Throughout"," Steps to 24 Hr Sobey’s Grocery Store, Danforth & Subway"," Amenities:"," 24/Hr Concierge"," Exercise Room"," Yoga Room"," Media Room"," Party/Meeting Room"," Visitor Parking"]
["km000535","SOLD","Family Residential","5","Butterfield Drive",1088000,null,"Spectacular Family Home!","Stunning Cathredral Ceilings & Principal Rooms!","LAWRENCE/UNDERHILL"," 43°44'56.99\"N"," 79°19'18.03\"W",{"$f":"IF(ISBLANK(K475),\"\",DMS_to_Dec(K475))","v":43.749163888888887},{"$f":"IF(ISBLANK(L475),\"\",DMS_to_Dec(L475))","v":-79.321674999999999},"http://www.karenmillar.com/spotlight_slideshow.php?id=km000535",null,null,null," 51 x 121.95, Rear: 72.75"," $5,539.17/2013"," 4 + 1"," Double Car Garage & 2 Car Parking","  1 x 5, 2 x 4, 1 x 2 Piece",null,null," May/June TBA","Ranchdale PS","Milne Valley MS","Victoria Park CI"," Inground Concrete Marbelite Pool with Natural Gas Heater"," Dual Zone Central Air Conditioning Space Pack Unit ’05 & New Compressors ’13"," High Efficiency Furnace ’13","  Two Gas Fireplaces"," Main Roof ’13 & Rear Roof ‘08"," 200 Amp Service"," Central Vacuum"," Updated Kitchen & Bathrooms"," Main Floor Family Room"," Hardwood Flooring Throughout"]
["km000536","SOLD","Family Residential","115","Oak Park Avenue",659900,null,"Beautifully Upgraded Family Home!","Super Size Backyard Deck Overlooking Professionally Landscaped Garden","WOODBINE/LUMSDEN"," 43°41'27.37\"N"," 79°18'32.39\"W",{"$f":"IF(ISBLANK(K476),\"\",DMS_to_Dec(K476))","v":43.690936111111107},{"$f":"IF(ISBLANK(L476),\"\",DMS_to_Dec(L476))","v":-79.308997222222217},"http://www.karenmillar.com/spotlight_slideshow.php?id=km000536",null,null,null," 25 x 100 ft."," $2,891.70/2013",3," 2 Car Parking"," 1 x 4, 1 x 3 Piece",null,null," 60 - 90 Days"," Gledhill Jr PS"," DA Morrison MS"," East York CI"," Furnace '05"," Central Air Conditioning '05"," 100 Amps"," New Kitchen '05"," New Bathrooms '05 & '14"," Renovated Lower Level '12"," Rare Extra Long Private Driveway"," Professionally Landscaped Front Garden"," Parks, Schools & Subway Only Steps Away"]
["km000537","SOLD","Condo","24","Anvil Millway",408800,null,"Sought After Townhome in Prestigious Bayview-York Mills Neighbourhood",null,"BAYVIEW/YORK MILLS"," 43°44'59.75\"N"," 79°22'59.96\"W",{"$f":"IF(ISBLANK(K477),\"\",DMS_to_Dec(K477))","v":43.749930555555558},{"$f":"IF(ISBLANK(L477),\"\",DMS_to_Dec(L477))","v":-79.383322222222219},"http://www.karenmillar.com/spotlight_slideshow.php?id=km000537",null,null,null,null," $2,455.43/2013",1," 1 Parking Spot"," 1 x 4 Piece"," Maintenance: $370.96/month (Includes: common elements, building insurance & parking)",null," April 2014/TBA","Harrison Public School","Windfields JHS","York Mills CI"," Cadillac Fairview Built Complex"," Close Proximity to York Mills Shopping Centre, Schools, Parks, Ttc, 401 & Yonge Subway"," Living Room Overlooks Inground Swimming Pool"," Lower Level with Separate Entrance"," Don Valley Golf Course"," St. Andrew's Park"," York Mills Arena"]
["km000538","SOLD","Family Residential","195","Glenvale Boulevard",748800,null,"Charming Leaside Bungalow!","Renovators or Builders! Opportunity Knocks!","LAIRD/EGLINTON"," 43°43'6.92\"N"," 79°21'57.98\"W",43.718588888888888,-79.366105555555549,"http://www.karenmillar.com/spotlight_slideshow.php?id=km000538",null,null,null," 30 x 128 (See Survey)"," $5,160.70/2013",2," Single Detached Garage + 4 Car Parking"," 1x4, 1x2 Piece",null,null," Immediate/TBA","Northlea E & MS","Northlea E & MS","Leaside HS"," "," "]
["km000539","SOLD","Family Residential","26","Rialto Drive",748800,null," Like New! A Rare Raised Bungalow With Walkout Lower Level To A Spacious Backyard And Totally Renovated Interior",null,"LAWRENCE/UNDERHILL"," 43°44'38.55\"N"," 79°19'4.10\"W",{"$f":"IF(ISBLANK(K479),\"\",DMS_to_Dec(K479))","v":43.744041666666668},{"$f":"IF(ISBLANK(L479),\"\",DMS_to_Dec(L479))","v":-79.317805555555552},"http://www.karenmillar.com/spotlight_slideshow.php?id=km000539",null,null,null," 50.50 x 119 ft."," $4,094.25/13"," 3 + 1"," Single car garage + 2 car parking"," 1 x 4, 2 x 3 Piece",null,null,"  March 2014 or tba","Cassandra PS/Ranchdale PS","Milne Valley MS","Victoria Park CI"," Windows & Doors ‘13"," New Light Fixtures"," New Stainless Steel Kitchen Appliances"," New Kitchen ‘11"," Master & Lower Level Bathroom ‘13"," Lower Level ‘13"," Roof ‘12"," 100 Amp Breaker Panel '11"]
["km000540","NEW","Executive","61","Talwood Drive",2888800,null,"Stunning, One of a Kind Contemporary Custom Barbini Re-Build Home"," ","LESLIE/LAWRENCE"," 43°44'27.52\"N"," 79°21'23.72\"W",43.740977777777779,-79.356588888888879,"http://www.karenmillar.com/spotlight_slideshow.php?id=km000540",null,null,null," 80 x 115 ft (rear 106')"," $5,298.66/2013",4," Double car garage + 4 car parking"," 2 x 5, 2 x 3, 1 x 2 Piece",null,null," Immediate or tba"," Rippleton PS","St Andrew's JHS/Windfields JHS","York Mills CI"," 11 Ft Floor-to-ceiling Windows on Main Floor"," Era Design Heated Appalachian Flooring"," Indoor/Outdoor Gas Fireplace"," Custom Walnut Kitchen"," Caesarstone Countertop & Backsplash"," All New Bathrooms"," 10 Ft Ceilings in Master Bedroom "," Bamboo Flooring in Master Bedroom"," Magnificent Master Dressing Room & Ensuite"," And Many More!"]
["km000541","SOLD","Family Residential","38","Caronport Crescent",778800,null,"Beautifully Updated & Sun-Flooded 3 Bedroom Bungalow! ",null,"LAWRENCE/UNDERHILL"," 43°44'38.29\"N"," 79°19'12.65\"W",{"$f":"IF(ISBLANK(K481),\"\",DMS_to_Dec(K481))","v":43.743969444444446},{"$f":"IF(ISBLANK(L481),\"\",DMS_to_Dec(L481))","v":-79.320180555555552},"http://www.karenmillar.com/spotlight_slideshow.php?id=km000541",null,null,null,"  55 x 110 Feet"," $3,822.05/2013"," 3 + 1"," Single Car Garage + 6 Car Parking","  1 x 4,  1x 3 Piece",null,null,"  Immediate/TBA","Cassandra PS/Ranchdale PS","Milne Valley MS","Victoria Park CI"," Roof  ‘11"," Furnace ’09"," Central Air Conditioning"," 100 Amp Service"," Almost All Windows Are Updated"," Additional Insulation in Attic"," Sun Flooded Main & Lower Level"," Updated Lower Level with Raised Flooring"]
["km000542","SOLD","Family Residential","36","Davean Drive",998800,null,"Beautifully Updated & Maintained 4 Bedroom Home in Dunlace School District!",null,"LESLIE/YORK MILLS"," 43°45'44.18\"N"," 79°21'59.14\"W",{"$f":"IF(ISBLANK(K482),\"\",DMS_to_Dec(K482))","v":43.762272222222222},{"$f":"IF(ISBLANK(L482),\"\",DMS_to_Dec(L482))","v":-79.366427777777773},"http://www.karenmillar.com/spotlight_slideshow.php?id=km000542",null,null,null," 50 x 120.5 ft"," $5,115.95/2013",4," Single car garage + 2 car parking"," 2 x 4, 1 x 2 Piece",null,null," May 15, 2014 or tba","Dunlace PS","Windfields JHS","York Mills CI"," Dunlace School District","Main Floor Family Room"," Large Family-Sized Backyard","100 Amp Service"," New Aluminum Windows '09"," New Garage Door '09"," Updated Kitchen '11"," Hardwood Flooring Throughout Main & Upper Floors"]
["km000543","ARCHIVE","Condo","352","Front Street W, #2011",359000,null,"Downtown Toronto Living At Its Best! New Sky High \"Fly\" Condo With Amazing Amenities",null,"FRONT/BLUE JAY WAY"," 43°38'35.57\"N"," 79°23'33.59\"W",{"$f":"IF(ISBLANK(K483),\"\",DMS_to_Dec(K483))","v":43.643213888888887},{"$f":"IF(ISBLANK(L483),\"\",DMS_to_Dec(L483))","v":-79.39266388888889},"http://www.karenmillar.com/spotlight_slideshow.php?id=km000543",null,null,null,null,0,1,null," 1 x 4 Piece"," $407.21/mo (includes water, heat, central air, parking, building insurance and common elements)",null," Immediate or TBA",null,null,null,"9 Foot Ceilings","Plank Laminate Flooring","Granite Kitchen Countertops","Stainless Steel Appliances","Private Balcony","City Views","Amenities Include:","24 Hour Concierge","Guest Suites for Family & Friends on 2nd Floor","Rooftop Party Room on the 24th Floor with Wet Bar, Chef’s Kitchen that Opens onto a Seasonal Rooftop Patio with Privacy Cabanas and BBQ Stations.","Walk-out Seasonal Courtyard from Lounge on 2nd Floor with Seating Areas and Garden.","Theatre and Multi-Media Studio","Professionally Equipped Exercise Room","Yoga and Pilates Studio","Juice Bar"]
["km000544","SOLD","Executive","18","Crestland Avenue",998800,null,"Spectacular Executive East York Residence",null,"COXWELL/MORTIMER"," 43°41'30.33\"N"," 79°19'29.43\"W",{"$f":"IF(ISBLANK(K484),\"\",DMS_to_Dec(K484))","v":43.691758333333333},{"$f":"IF(ISBLANK(L484),\"\",DMS_to_Dec(L484))","v":-79.324841666666657},"http://www.karenmillar.com/spotlight_slideshow.php?id=km000544",null,null,null," 30 x 105 Feet","$6,092.90/2013",4," Detached Garage and Single Car Parking"," 1 x 5, 1 x 4, 1 x 3,1 x 2 Piece",null,null," 90 days or tba","RH McGregor ES","Cosburn MS","East York CI"," 200 Amp Service"," Central Vacuum"," High Efficiency Furnace ’09"," Central Air Conditioning ’09"," Roof ’09"," Central Sound System & Built-in Speakers Throughout Main & Lower Levels"," Custom Draperies Throughout"," Exterior Garden Lighting with Remote Controls"]
["km000546","NEW","Condo","85","The Donway West, Suite 708",449900,null,"Brand New Reflections Residences at The Shops at Don Mills","Be One of the First to Experience this New Urban Village","DON MILLS/LAWRENCE"," 43°43'58.04\"N"," 79°20'46.17\"W",43.732788888888891,-79.346158333333335,"http://www.karenmillar.com/spotlight_slideshow.php?id=km000546",null,null,null,null," $/0 To Be Assessed"," 1 + 1 "," 1 Parking Spot "," 1 x 4, 1 x 3 Piece"," $548.14/mo (includes water, heat, parking, building insurance & common elements)",1," Immediate or TBA",null,null,null," Stainless Steel Appliances"," Engineered Hardwood Flooring"," Granite Countertop"," Upgraded Kitchen Pendants & Den Lighting"," Ensuite Laundry"," Unobstructed Western Views of Toronto Skyline"," 2 Sliding Door Walkouts to Balcony"," Steps to Shops at Don Mills, Restaurants & McEwan’s"]
["km000547","SOLD","Executive","443A","Queen Street East",null,2950,"Brand New Executive Queen Street Townhome with Gorgeous Finishes Including Hardwood Flooring, Stainless Steel Appliances & Spa-Like Master Ensuite Bathroom",null,"QUEEN ST E/ST. PAUL"," 43°39'23.08\"N"," 79°21'37.66\"W",{"$f":"IF(ISBLANK(K486),\"\",DMS_to_Dec(K486))","v":43.656411111111112},{"$f":"IF(ISBLANK(L486),\"\",DMS_to_Dec(L486))","v":-79.360461111111107},"http://www.karenmillar.com/spotlight_slideshow.php?id=km000547",null,null,null,null,null,3," 1 Underground Parking Spot"," 1 x 5, 1 x 3, 1 x 2 Piece",null,null," Immediate or TBA","Nelson Mandela Park PS","Nelson Mandela Park PS","Jarvis CI"," Stainless Steel Appliances"," Hardwood Flooring"," Granite Kitchen Countertop "," Master Ensuite with Private Sauna"," High Ceilings"," Spacious Private Rooftop Terrace"," Corner Unit with Gorgeous Views of Toronto"," Gas BBQ Hookup on Rooftop Patio"," Central Air Conditioning"," Steps to Great Shops, Restaurants, TTC, DVP & minutes to Downtown"]
["km000548","SOLD","Family Residential","41","Tinder Crescent",648800,null," Beautiful 3 Bedroom Home!  Move-In Ready!",null,"VICTORIA VILLAGE"," 43°43'36.92\"N"," 79°18'38.68\"W",{"$f":"IF(ISBLANK(K487),\"\",DMS_to_Dec(K487))","v":43.726922222222221},{"$f":"IF(ISBLANK(L487),\"\",DMS_to_Dec(L487))","v":-79.310744444444438},"http://www.karenmillar.com/spotlight_slideshow.php?id=km000548",null,null,null," 54.11 x 120 Feet (per survey)"," $3,829.50/2013"," 3 + 1"," Single Car Garage & 3 Car Parking"," 1 x 4, 1 x 3 Piece",null,null," June 2014 or TBA"," Sloane PS"," Milne Valley MS"," Victoria Park CI"," New Raised Composite Deck ’13"," New Canadian Rolltec Acrylic Retractable Awning ’13 "," California Style Blinds '13"," Kitchen Updated ’14"," Allure Floating Resilient Plank Flooring ’13"," Berber Broadloom in Lower Level '12"]
["km000549","SOLD","Family Residential","9","Carpendale Crescent",349900,null," Premium Corner Lot! "," Beautiful 3 Bedroom Home with Family Sized Backyard!","AUDLEY/TAUNTON"," 43°53'40.66\"N"," 79° 0'40.95\"W",{"$f":"IF(ISBLANK(K488),\"\",DMS_to_Dec(K488))","v":43.894627777777778},{"$f":"IF(ISBLANK(L488),\"\",DMS_to_Dec(L488))","v":-79.011375000000001},"http://www.karenmillar.com/spotlight_slideshow.php?id=km000549",null,null,null,"41.9 x 82 ft (rear 46 ft.) irregular lot"," $3,458/2013",3," Single Car Garage + 2 Car Parking"," 1 x 4, 1 x 2 Piece",null,null," 60 - 90 Days or tba","Rmoeo Dallaire P.S.",null,"J. Clarke Richardson C.I."," Central Air Conditioning '07"," Furnace February '14"," 100 Amp Service"," Central Vacuum"," Sliding Door Walkout to Backyard"," Bamboo Flooring"," Fully Fenced Backyard"," Overlooks Park"]
["km000552","SOLD","Executive","45","Cornerbrook Drive",849900,null,"Totally Renovated with Superior Finishes and Workmanship","Prime Lot Overlooking Ravine! The Best of City Living in a Country Setting!","LAWRENCE/UNDERHILL"," 43°44'34.11\"N"," 79°19'47.51\"W",{"$f":"IF(ISBLANK(K489),\"\",DMS_to_Dec(K489))","v":43.742808333333336},{"$f":"IF(ISBLANK(L489),\"\",DMS_to_Dec(L489))","v":-79.32986388888888},"http://www.karenmillar.com/spotlight_slideshow.php?id=km000552",null,null,null," 65 x 130 Feet (Ravine)"," $4,506.29/2013","3 + Main Floor Den"," Double Carport & 4 Car Parking"," 1x4, 1x3, 1x2 Piece",null,null," Immediate/TBA","Cassandra PS","Milne Valley MS","Victoria Park CI","Ravine Lot with Large Table Land","Newly Renovated From Top to Bottom","Flat Roof ’13","Lennox Air Flo 2.5 ton Central Air Conditioning ’12","Lennox Air Flo High Efficiency Two Stage Gas Furnace ’12","Kitchen ’14","Main Floor Family Room with Gas Fireplace ’12","100 Amp Service ’14","All New Windows ’12 & Doors ’13"]
["km000550","SOLD","Executive","219","Davisville Avenue",798800,null,"One Of A Kind Spacious Freehold Townhouse With A Super Size Back Garden Backing Onto Green Space And Facing June Rowlands Park.",null,"MT PLEASANT/DAVISVILLE"," 43°41'59.23\"N"," 79°23'21.47\"W",{"$f":"IF(ISBLANK(K490),\"\",DMS_to_Dec(K490))","v":43.699786111111109},{"$f":"IF(ISBLANK(L490),\"\",DMS_to_Dec(L490))","v":-79.389297222222226},"http://www.karenmillar.com/spotlight_slideshow.php?id=km000550",null,null,null," 20.93 x 103 Feet"," $4,304.93/2013",3," Single Car Garage & 1 Car Parking"," 1x4, 1x3, 1x2 Piece",null,null," August 1/TBA","Davisville Jr PS","Hodgson Sr PS","North Toronto CI"," All Windows Replaced ’07"," Roof ’09"," Mid Efficiency Furnace ’08 with Humidifier ’12"," Central Air Conditioning"," Updated Kitchen ’12","Updated Bathrooms ’10 & ‘13","Crown Moulding Updated ’08","100 Amp Service"]
["km000551","SOLD","Condo","7","Cora Urbel Way",798800,null,"Rare, 2-Storey Spacious (over 1765 sf) Townhome with Double Car Parking, Walkout Lower Level & a Large Deck off the Kitchen for Entertaining!",null,"DONWAY WEST/LAWRENCE"," 43°43'49.55\"N"," 79°21'4.81\"W",{"$f":"IF(ISBLANK(K491),\"\",DMS_to_Dec(K491))","v":43.730430555555557},{"$f":"IF(ISBLANK(L491),\"\",DMS_to_Dec(L491))","v":-79.35133611111111},"http://www.karenmillar.com/spotlight_slideshow.php?id=km000551",null,null,null,null," $4,251/2013",3," Double Car Garage & 2 Car Parking","  2x4, 1x2 Piece"," $354.03/month (includes: water, common elements, building insurance & parking,)",null," June/July 2014","Greenland PS/Norman Ingram PS","Don Mills MS","Don Mills CI"]
["km000545","SOLD","Executive","42","Yewfield Crescent",2288800,null,"This Custom Built, Elegant and Graceful Residence Overlooks the Donalda Golf & Country Club, Providing Magnificent Vistas All Year Round",null,"LESLIE/LAWRENCE"," 43°44'53.92\"N"," 79°20'40.13\"W",{"$f":"IF(ISBLANK(K492),\"\",DMS_to_Dec(K492))","v":43.748311111111114},{"$f":"IF(ISBLANK(L492),\"\",DMS_to_Dec(L492))","v":-79.344480555555549},"http://www.karenmillar.com/spotlight_slideshow.php?id=km000545",null,"http://youtube.com/embed/XwuhIpnRXzM","n"," 53.5 x 178.96 ft. (91' rear) overlooking Ravine/Golf Course"," $10,880.72/2013"," 4 + 1"," Garage + 4 car parking"," 2 x 5, 2 x 4, 1 x 2 Piece",null,null," 90 Days/TBA","Greenland PS/Norman Ingram PS","Don Mills MS","Don Mills CI"," Custom Built Home"," Overlooks Donalda Golf Course"," Renovated from Top to Bottom"," Furnace '08"," Central Air Conditioning '08"," Central Vacuum"," 200 Amp Service"," Stainless Steel Appliances"]
["km000553","SOLD","Executive","7","Kirkdale Crescent",1388000,null,"Super Opportunity For Builder Or Renovator!!"," One Of The Most Desirable Neighbourhoods In Toronto","LESLIE/LAWRENCE"," 43°44'14.42\"N"," 79°21'27.59\"W",{"$f":"IF(ISBLANK(K493),\"\",DMS_to_Dec(K493))","v":43.737338888888893},{"$f":"IF(ISBLANK(L493),\"\",DMS_to_Dec(L493))","v":-79.357663888888879},"http://www.karenmillar.com/spotlight_slideshow.php?id=km000553",null,null,null," 48.6 Rear: 117 East: 152.9 West: 132.1"," $7,181.72/2013",3," Single Car Garage & 6 Car Parking"," 1 x 5, 1 x 3, 1 x 3 (roughed-in)",null,null," 90-120 Days/TBA"," Rippleton PS"," St Andrew's JHS/Windfields JHS"," York Mills CI"," Roof ’12"," Furnace ’13"," Central Air Conditioning ’13"," 125 Amp Service"," In-ground Pool"," Main Floor Family Room"," Central Vacuum"," Main Floor & Recreation Room Wired Surround System"]
["km000554","SOLD","Executive","57","Olsen Drive",1048800,null,"Exceptional Executive Family Home In The Prestigious Donalda Country & Golf Club!"," Super Spacious Principle Rooms Including An Extra Large Family Room With W/O To Garden!","DON MILLS/YORK MILLS"," 43°45'38.12\"N"," 79°20'40.78\"W",{"$f":"IF(ISBLANK(K494),\"\",DMS_to_Dec(K494))","v":43.76058888888889},{"$f":"IF(ISBLANK(L494),\"\",DMS_to_Dec(L494))","v":-79.344661111111108},"http://www.karenmillar.com/spotlight_slideshow.php?id=km000554",null,null,null," 95 x 60 Feet Rear: 102.42 Feet"," $5,595.10/2013"," 4 + 1"," Double Car Garage & 2 Car Parking"," 1 x 4,  2x 3 Piece",null,null,"  June/July TBA"," Rene Gordon HWA"," Donview MHWA"," George S Henry Academy"," Roof ’06"," 100 Amp Service"," Updated Kitchen"," New Upper Level Bathrooms ’12"," All Updated Windows"," Walk-out to Balcony fromt Master Bedroom & Nursery"," Lower Level Family Room","Backyard Oasis"]
["km000556","SOLD","Family Residential",87,"Dutch Myrtle Way",698800,null,"Executive Contemporary Townhouse","1800 Square Feet of Open & Sun-Flooded Space","DON MILLS/LAWRENCE"," 43°44'23.42\"N"," 79°20'34.54\"W",43.73983888888889,-79.342927777777774,"http://www.karenmillar.com/spotlight_slideshow.php?id=km000556",null,null,null," "," $2,841.37/2013",3," Single Car Garage + Single Car Parking"," 2 x 4, 1 x 3, 1 x 2 Piece"," $535.00/mo (includes water, cable television, snow, garbage & recycling removal, common elements & building insurance)",null," 90 Days or Tba"," Greenland Public School, Norman Ingram Public School"," Don Mills Middle School"," Don Mills Collegiate Institute"," Kimberley Stewart Designed Townhome"," New Hardwood Flooring & Berber Broadloom"," Second Floor Family Room"," Central Vacuum"," Central Air Conditioning ‘13"," 100 Amp Service"," New Windows & Doors ‘12"," New Garage Door '12"," Close to Schools, Parks, The Shops at Don Mills, The Donalda Golf Club, Ttc & the Dvp"]
["km000555","SOLD","Family Residential","74","Princeway Drive",499900,null,"Opportunity Knocks! First Time Buyers Alert!","Potential For The Savvy Investor Or First Home Buyer","LAWRENCE/PHARMACY"," 43°45'10.82\"N"," 79°18'34.06\"W",{"$f":"IF(ISBLANK(K496),\"\",DMS_to_Dec(K496))","v":43.753005555555553},{"$f":"IF(ISBLANK(L496),\"\",DMS_to_Dec(L496))","v":-79.309461111111105},"http://www.karenmillar.com/spotlight_slideshow.php?id=km000555",null,null,null," 45 x 112 Feet"," $2,539.33/2013",3," 4 Car Parking"," 1 x 4, 1 x 2 Piece",null,null," Immediate/TBA"," Maryvale PS"," Maryvale PS"," Wexford CSA"," New Broadloom April '14"," Roof '04"," Walkout to Deck from Master Bedroom"," Eat-in Kitchen"," "]
["km000559","SOLD","Executive","39","Beveridge Drive",958800,null,"Beautiful Executive Family Home with Lots of $$$$$ Spent on Upgrades!",null,"LAWRENCE/UNDERHILL"," 43°44'55.16\"N"," 79°19'19.28\"W",{"$f":"IF(ISBLANK(K497),\"\",DMS_to_Dec(K497))","v":43.748655555555558},{"$f":"IF(ISBLANK(L497),\"\",DMS_to_Dec(L497))","v":-79.322022222222216},"http://www.karenmillar.com/spotlight_slideshow.php?id=km000559",null,null,null," 55.68 x 112 Feet"," $4,767.30/2014"," 4 + 1"," Double Car Garage & 4 Car Parking"," 1 x 5, 1 x 4, 1 x 3, 1 x 2 Piece",null,null," August 2014/TBA","Ranchdale PS","Milne Valley MS","Victoria Park CI"," Roof ’08 with Additional Insulation ’10"," Carrier Furnace ’07"," Central Air Conditioner ’07"," 100 Amp Service"," Main Floor Renovated ’10"," Lower Level Totally Renovated ’09"," Two Fireplaces"," Kitchen ’10"," All Windows ’10"," Refinished Hardwood Flooring Throughout ’06"," Updated Bathrooms"]
["km000558","SOLD","Family Residential","43","Camwood Crescent",798800,null,"Super Spacious & Well Maintained Bungalow!","This Wonderful Home Has a Lovely Back Garden with an Entertainment Size Deck!","YORK MILLS/DON MILLS"," 43°45'39.50\"N"," 79°20'19.84\"W",{"$f":"IF(ISBLANK(K498),\"\",DMS_to_Dec(K498))","v":43.760972222222222},{"$f":"IF(ISBLANK(L498),\"\",DMS_to_Dec(L498))","v":-79.338844444444433},"http://www.karenmillar.com/spotlight_slideshow.php?id=km000558",null,null,null," 66 x 91.52 Feet"," $4,262.05/2013"," 3 + 1"," Single Car Garage + 4 Car Parking"," 1 x 4, 1 x 3 Piece",null,null," 90 Days/TBA","Rene Gordon HWA","Donview MHWA","George S Henry Academy"," Roof, Shingles, Sheeting, Upgraded Insulation & Eaves Troughs All New in 2013"," 100 Amp Service"," Central Vacuum"," Main Bathroom ’07"," All Updated Windows"," Wheel Chair Accessible with Ramp Off Back Deck"]
["km000557","SOLD","Family Residential","60","Wallingford Road",588800,null,"This is a Diamond in the Rough! Super Opportunity for the Savvy Renovator or Investor!",null,"YORK MILLS/DVP"," 43°45'24.98\"N"," 79°19'35.91\"W",{"$f":"IF(ISBLANK(K499),\"\",DMS_to_Dec(K499))","v":43.756938888888889},{"$f":"IF(ISBLANK(L499),\"\",DMS_to_Dec(L499))","v":-79.32664166666666},null,null,null,null," 62 x 110 Feet"," $4,601.37/2013",3,"  Single Car Garage & 4 Car Parking","  1 x 4, 1 x 3 Piece",null,null," 60-90 Days/TBA"," Ranchdale PS"," Donview MHWA"," Victoria Park CI"," Large Lot"," Furnace ’10"," 200 Amp Service"," Two Sided Wood Burning Fireplace"]
["km000560","SOLD","Executive","46","Crossburn Drive",1288800,null,"Ravine Lot With 161' Of Table Land In The Prestigous Donolda Club Neighbourhood!"," One Of A Kind Contemporary Home On A Sought After Street In Don Mills!","DON MILLS/LAWRENCE"," 43°44'37.60\"N"," 79°20'29.48\"W",{"$f":"IF(ISBLANK(K500),\"\",DMS_to_Dec(K500))","v":43.74377777777778},{"$f":"IF(ISBLANK(L500),\"\",DMS_to_Dec(L500))","v":-79.341522222222224},"http://www.karenmillar.com/spotlight_slideshow.php?id=km000560",null,null,null," 36 x 161 Feet (Ravine)"," $5,384.43/2013",4," Single Car Garage & 4 Car Parking"," 1 x 5, 1 x 4, 2 x 2, 1 x 1 Piece",null,null," 90 Days/TBA"," Greenland PS/Norman Ingram PS"," Don Mills MS"," Don Mills CI"," Roof ’06"," Inground Automatic Sprinkler System"," Soffits & Eavestrouphs ’08"," Overlooks Donalda Golf Course"," Table land"," Floor-to-Ceiling & Wall-to-Wall Windows in Dining Room & Master Bedroom `08"," 200 Amp Service"," Large Sauna with Standing Shower"]
["km000561","SOLD","Family Residential","41","Chatfield Drive",998800,null,"This Enchanting Home Has A Magnificent Wrap Around Garden Where The Wonderful New Windows In The Home Invites The Outside In!",null,"LESLIE/LAWRENCE"," 43°44'36.96\"N"," 79°21'17.20\"W",{"$f":"IF(ISBLANK(K501),\"\",DMS_to_Dec(K501))","v":43.743600000000001},{"$f":"IF(ISBLANK(L501),\"\",DMS_to_Dec(L501))","v":-79.35477777777777},"http://www.karenmillar.com/spotlight_slideshow.php?id=km000561",null,null,null," 90 x 105.04 Feet"," $4,955.61/2013",3," Single Attached Garage & 4 Car Parking"," 1 x 4, 1 x 3 Piece",null,null," 90 Days/TBA","Rippleton PS","St Andrew's JHS/Windfields JHS","York Mills CI"," Roof ’11"," Furnace ’00"," Central Air Conditioner ’01"," All New Windows '08"," Hardwood Flooring Throughout ’00"," Updated Kitchen ‘01"]
["km000566","SOLD","Family Residential","163","Three Valleys Drive",629900,null," What a Charmer! Gorgeous 4 Bedroom Home in the Prestigious Donalda Golf Club Neighbourhood!",null,"YORK MILLS/DON MILLS"," 43°44'36.96\"N"," 79°21'17.20\"W",{"$f":"IF(ISBLANK(K502),\"\",DMS_to_Dec(K502))","v":43.743600000000001},{"$f":"IF(ISBLANK(L502),\"\",DMS_to_Dec(L502))","v":-79.35477777777777},"http://www.karenmillar.com/spotlight_slideshow.php?id=km000566",null,null,null," 77.81 x 141 Feet"," $2,630.69/2013 ",4," 6 Car Parking"," 1 x 4, 1 x 2 Piece",null,null," 90 Days/TBA"," Three Valleys PS"," Milne Valley MS"," George S Henry Academy"," Roof ’11"," High Efficiency Furnace with Humidifier ’09"," High Efficiency Central Air Conditioner ’09"," Tankless Hot Water Heater ’09"," 100 Amp Service"," Additional Attic Insulation ’09"," Hardwood Flooring Throughout Main Floor ’11"," All New Interior Doors & Hardware"," All New Baseboards"," All Updated Windows"," New Driveway ’12 "," New Landscaping & Lighting in Front Garden ’12"," New Bathrooms ’11"," 100 Amp Service"]
["km000562","ARCHIVE","Condo","55","Bamburgh Circle, Suite 1707",318800,null,"Tridel Built! Super Spacious Two Bedroom Corner Suite With A Million Dollar View!",null,"McNICOLL/WARDEN"," 43°48'53.83\"N"," 79°19'37.82\"W",{"$f":"IF(ISBLANK(K503),\"\",DMS_to_Dec(K503))","v":43.814952777777776},{"$f":"IF(ISBLANK(L503),\"\",DMS_to_Dec(L503))","v":-79.327172222222217},"http://www.karenmillar.com/spotlight_slideshow.php?id=km000562",null,null,null,null," $1,761.87/2013",2," 1 Underground Parking Space (B1-4)"," 1 x 4, 1 x 2 Piece"," $555.26 (includes: Central Air, Water, Heat, Parking, Building Insurance & Common Elements).",null," Immediate/TBA"," Sir Samuel B Steele Jr PS/Terry Fox PS"," Sir Ernest MacMillan Sr PS/Terry Fox PS"," Dr Norman Bethune CI"," Panoramic City Views"," Eat-n Kitchen"," Laminate Flooring"," Open Concept"," Ensuite Laundry"," Close to Parks, Schools, Transportation & Shops"," Amenities:","  Exercise Room"," Indoor & Outdoor Pools"," Party/Meeting Room"," Recreation Room"," Security Guard"," Visitor Parking"," Tennis Courts"]
["km000567","SOLD","Luxury","6","Tintagel Road",3598800,null,"Cocooning in Sheer Luxury and Comfort!","7000 Sf Ft of Custom Quality Craftsmanship","LESLIE/LAWRENCE"," 43°44'26.53\"N"," 79°21'53.25\"W",{"$f":"IF(ISBLANK(K504),\"\",DMS_to_Dec(K504))","v":43.740702777777777},{"$f":"IF(ISBLANK(L504),\"\",DMS_to_Dec(L504))","v":-79.364791666666662},"http://www.karenmillar.com/spotlight_slideshow.php?id=km000567",null,null,null," 94 x 150 Feet (irregular) Total Area: 12,272 ft"," $16,749.89/2013"," 4 + 1"," Three-Car Tandem Garage & 7 Car Parking"," 1 x 5, 1 x 4, 4 x 3, 1 x 2 Piece",null,null," July 2 2014/TBA","Rippleton PS","St Andrew's JHS/Windfields JHS","York Mills CI"," Green House Certified"," Energy Star Certified"," New Construction ’09"," 200 Amp Service"," Four Gas Fireplaces"," High Ceilings Throughout",null," White Oak Flooring Throughout"," Hydraulically Heated Stone & Marble Flooring"," Hydraulically Heated Entire Basement Floor"," Hydraulically Heated Garage Floor"," Hydraulically Heated Room Above Garage"," Custom Barbini Kitchen"," Custom Millwork Throughout"," Two Central Vacuum Systems","  Custom Lutron Integrated Lighting System for General Hallways & Kitchen"," Custom Russound System"," Custom Security System with Four Cameras & DVR"," Solar Panelling on Roof"," Litre Rain Water Cistern for Irrigation and Toilets"," Barrier-Free Cambridge Hydraulic Elevator"," Integrated HRV & ERV Ventilation Systems for Washrooms"," Electronically Automated Blinds in Two-Storey Windows of Family Room"," Two Miele Dishwashers in Custom Kitchen"," Dog and Boot Shower at Side Entrance"," Pro Steam Shower in Spa Bathroom"," Toto Washlet in Master Bathroom"," Center Plan Oval Skylight Feature"," Skylight in Master Dressing Room"," JulietteBalcony in Master Sitting Room"]
["km000565","SOLD","Executive","82","Olsen Drive",998000,null,"Wonderful Executive Family Home in the Prestigious Donalda Golf and Country Club Neighbourhood!",null,"YORK MILLS/DON MILLS"," 43°45'43.27\"N"," 79°20'43.34\"W",{"$f":"IF(ISBLANK(K505),\"\",DMS_to_Dec(K505))","v":43.762019444444448},{"$f":"IF(ISBLANK(L505),\"\",DMS_to_Dec(L505))","v":-79.345372222222224},"http://www.karenmillar.com/spotlight_slideshow.php?id=km000565",null,null,null," 60 x 125 Feet","$6,215.95/2013"," 4+1"," Double Car Garage & 2 Car Parking"," 2x4, 1x3, 1x2 Piece",null,null," July 2014/TBA","Rene Gordon HWA","Donview MHWA","George S Henry Academy"," Kitchen ’04"," Roof ’03"," Furnace ’95"," Central Air Conditioner ’95"," 100 Amp Service"," All Updated Windows"," All Updated Bathrooms"," Professionally Landscaped Front & Back Gardens"," New Chimney"]
["km000563","SOLD","Executive","113","Cassandra Boulevard",898800,null,"Super Executive Family Home Beautifully Updated Throughout!","Super Lot with Stunning Gardens Front and Back Including a Tiered Deck!","LAWRENCE/UNDERHILL"," 43°45'3.22\"N"," 79°19'47.08\"W",{"$f":"IF(ISBLANK(K506),\"\",DMS_to_Dec(K506))","v":43.750894444444441},{"$f":"IF(ISBLANK(L506),\"\",DMS_to_Dec(L506))","v":-79.329744444444444},"http://www.karenmillar.com/spotlight_slideshow.php?id=km000563",null,null,null," 58 x 114 Feet"," $4,713.24/2013",4," Double Car Garage & 2 Car Parking"," 1 x 4, 1 x 3, 1 x 2 Piece",null,null," July 2014/TBA","Cassandra PS","Milne Valley MS","Victoria Park CI"," Roof ’10"," High Efficiency Furnace ’11"," Central Air Conditioning"," 100 Amp Service"," Custom Updated Windows"," Wired Multi-Location Surround System"," All New Bathrooms"," Updated Kitchen"," Finished Lower Level ’11"," Four Extra Large Bedrooms"," Amazing Location with Parks, Shops, Schools, Ttc, 401 and Dvp Only Steps Away"]
["km000568","SOLD","Executive","32","Yewfield Crescent",1588000,null,"Stunning & Spacious Three Level Back-Split Backing on to Donalda Golf Course ",null,"DON MILLS/YORK MILLS"," 43°44'56.86\"N"," 79°20'40.85\"W",{"$f":"IF(ISBLANK(K507),\"\",DMS_to_Dec(K507))","v":43.74912777777778},{"$f":"IF(ISBLANK(L507),\"\",DMS_to_Dec(L507))","v":-79.344680555555556},"http://www.karenmillar.com/spotlight_slideshow.php?id=km000568",null,null,null," 65 x 106.13 ft.  Rear 70'"," $7,424.09/2013","3 + 1"," Double Car Garage & 4 Car Parking","  2 x 4, 1 x 2 Piece",null,null," 90 Days/TBA","Greenland PS/Norman Ingram PS","Don Mills MS","Don Mills CI"," Golf Course Views"," All Updated Windows"," Roof '12"," Extra Wide Eavestroughs '12"," Split Burner Furnace '12 with Humidifier, Premium Air Filter System & New Surrounding Duct Work","  Central Air Conditioner '12"," Central Vacuum with New Motor '14"," Tankless Hot Water System '13"]
["km000564","SOLD","Family Residential","3","Hurlingham Crescent",1198000,null,"Spacious Family Home in Denlow School District on Spectaclar Lot!","Two Walkouts from Lower Level to an Awesome Backgarden","LESLIE/YORK MILLS"," 43°45'0.67\"N"," 79°21'26.20\"W",{"$f":"IF(ISBLANK(K508),\"\",DMS_to_Dec(K508))","v":43.750186111111113},{"$f":"IF(ISBLANK(L508),\"\",DMS_to_Dec(L508))","v":-79.357277777777767},"http://www.karenmillar.com/spotlight_slideshow.php?id=km000564",null,null,null," 62 x 230 ft Rear 75'"," $5,572.73/2013"," 4 + 1"," Carport & 4 Car Parking"," 2x4, 1x3, 1x2 Piece ",null,null," Sept 2014/TBA","Denlow PS","Windfields JHS","York Mills CI"," Roof ’08"," Central Air Conditioner ’05"," Furnace with Humidifier ’07"," Additional Attic Insulation ’07"," 200 Amp Service"," Central Vacuum"," Mostly Updated Windows"," Updated Kitchen"," Inground Pool"," Rare Large Lot"," Underground Sprinklers in Front, Back & Side Yards"]
["km000569","SOLD","Executive","10","Ruden Crescent",1488000,null,"In The Prestigious Donalda Golf Club Neighbourhood is Where You Will Find This Exceptional & Rare Large Private, Park-Like Lot!",null,"YORK MILLS/DON MILLS"," 43°45'26.94\"N"," 79°20'33.52\"W",{"$f":"IF(ISBLANK(K509),\"\",DMS_to_Dec(K509))","v":43.757483333333333},{"$f":"IF(ISBLANK(L509),\"\",DMS_to_Dec(L509))","v":-79.342644444444446},"http://www.karenmillar.com/spotlight_slideshow.php?id=km000569",null,null,null," 60 x 182.79 Rear: 153.96 East: 167.82"," $7,723.42/2014"," 3 + 1"," Double Car Garage & Two Car Parking"," 3 x 3, 1 x 1 Piece",null,null," 90 Days/TBA","Rene Gordon HWA","Donview MHWA","George S Henry Academy"," Rare Large Private Lot"," Roof ’10 with Transferable Warranty Expiring 2030"," Updated Kitchen"," Spacious & Sun Filled"," Refurbished In-ground Salt Water Gunite Pool ’08"," 100 Amp Service"," Central Air Conditioning"]
["km000571","SOLD","Executive","41","Beveridge Drive",998800,null,"This is a Wonderful Executive 4 Bedroom Tudor  Home in a Sought After Neighbourhood",null,"LAWRENCE/UNDERHILL"," 43°44'55.27\"N"," 79°19'18.47\"W",{"$f":"IF(ISBLANK(K510),\"\",DMS_to_Dec(K510))","v":43.748686111111112},{"$f":"IF(ISBLANK(L510),\"\",DMS_to_Dec(L510))","v":-79.321797222222216},"http://www.karenmillar.com/spotlight_slideshow.php?id=km000571",null,null,null," 66.46 x 114.08 Feet"," $4,967.07/2014",4," Double Car Garage & Two Car Parking"," 1x5, 1x4, 2x2 Piece",null,null," 30 Days/TBA","Ranchdale PS","Milne Valley MS","Victoria Park CI"," Roof ’13"," Hardwood Flooring Throughout"," Main Floor Family Room"," Finished Lower Level"," Two Walk-outs to Garden"," Two Wood Burning Fireplaces, Cleaned ’13"," 200 Amp Service"]
["km000572","SOLD","Family Residential","80","Dutch Myrtle Way",698800,null,"Stunning Executive Townhome in the Heart of Don Mills!","This Exquisite End Unit has a Walkout from the Lower Level and Kitchen!","DON MILLS/LAWRENCE"," 43°44'22.84\"N"," 79°20'35.31\"W",{"$f":"IF(ISBLANK(K511),\"\",DMS_to_Dec(K511))","v":43.739677777777779},{"$f":"IF(ISBLANK(L511),\"\",DMS_to_Dec(L511))","v":-79.343141666666668},"http://www.karenmillar.com/spotlight_slideshow.php?id=km000572",null,null,null,null," $2,967.95/2014",3," Single Car Garage & 1 Car Parking"," 2 x 4, 1 x 3, 1 x 2 Piece"," $535 (includes: water, cable, and parking, building insurance & common elements)",null," 90 Days or TBA"," Greenland Public School, Norman Ingram Public School"," Don Mills Middle School"," Don Mills Collegiate Institute"," 100 Amp Service"," Roof  ‘13"," All Updated Windows ‘13"," Modern Kitchen"," Central Air Conditioning"," Central Vacuum"," New Hardwood Flooring"]
["km000574","ARCHIVE","Family Residential","111","Marlow Avenue",499500,null,"A Warm and Welcoming Detached Home Just Steps from the Exciting Danforth, Where Dining, Entertainment and Shopping are in Abundance!",null,"DONLANDS/MORTIMER"," 43°41'15.41\"N"," 79°20'20.97\"W",{"$f":"IF(ISBLANK(K512),\"\",DMS_to_Dec(K512))","v":43.687613888888883},{"$f":"IF(ISBLANK(L512),\"\",DMS_to_Dec(L512))","v":-79.33915833333333},"http://www.karenmillar.com/spotlight_slideshow.php?id=km000574",null,null,null," 18 x 93.11 ft."," $2,776.36/2014",2," 1 Parking Spot"," 1x4 Piece",null,null," 60 Days/TBA","RH McGregor ES","Cosburn MS","East York CI"," Steps to Danforth"," Furnace ‘07"," Updated Kitchen"," 100 Amp Service"," All Updated Plumbing"," All New Insulation Throughout"," Large Lot"]
["km000575","SOLD","Condo","5","Concorde Place #510",218800,null,"Stunning Suite With Breathless Tree Top Views!","Furniture Friendly Layout With Floor To Ceiling Windows!","CONCORDE/DVP"," 43°43'45.82\"N"," 79°19'41.52\"W",{"$f":"IF(ISBLANK(K513),\"\",DMS_to_Dec(K513))","v":43.729394444444445},{"$f":"IF(ISBLANK(L513),\"\",DMS_to_Dec(L513))","v":-79.328199999999995},null,null,null,null,null,"$1,442.40/2014",1," 1 Parking Spot"," 1 x 4 Piece"," $305.15/mo (includes water, parking, building insurance & common elements)",1," August 29, 2014 or tba",null,null,null,"Amenities:"," 24 Hour Concierge/Security"," Indoor pool"," Gym","Board Room"," Library"," Billiard & Ping Pong Room"," Squash & Raquetball Courts","Tennis Courts"," Party Room"," Visitor parking"," Guest Suite"]
["km000570","SOLD","Family Residential","187","Three Valleys Drive",829900,null,"A Spectacular Semi With Over 2200 Sf Plus Lower Level! Directly Across For The Donalda Golf Club Walking Path",null,"DON MILLS/YORK MILLS"," 43°44'43.75\"N"," 79°20'16.52\"W",{"$f":"IF(ISBLANK(K514),\"\",DMS_to_Dec(K514))","v":43.745486111111113},{"$f":"IF(ISBLANK(L514),\"\",DMS_to_Dec(L514))","v":-79.337922222222218},"http://www.karenmillar.com/spotlight_slideshow.php?id=km000570",null,null,null," 64 x 113 Feet"," $3,531.90/2014",3," Carport & 3 Car Parking"," 2 x 4, 1 x 2 Piece",null,null," 30 Days/TBA","Three Valleys PS","Milne Valley MS","George S Henry Academy"," Hardwood Flooring Throughout ’14"," Two Fireplaces"," Furnace ’07"," In-ground Pool"," 200 Amp Service"," Central Air Conditioning"," Spacious & Sun Flooded Home"]
["km000573","NEW","Family Residential","4","Lochinvar Crescent",849900,null,"Stunning Home In A Wonderful Neighbourhood Of Don Mills. Easy Access To Parks, Ravines,Schools, Ttc, Dvp And 401.",null,"DON MILLS/YORK MILLS"," 43°45'29.00\"N"," 79°20'22.75\"W",{"$f":"IF(ISBLANK(K515),\"\",DMS_to_Dec(K515))","v":43.758055555555558},{"$f":"IF(ISBLANK(L515),\"\",DMS_to_Dec(L515))","v":-79.339652777777772},"http://www.karenmillar.com/spotlight_slideshow.php?id=km000573",null,null,null," 50 x 125 Feet","  $4,638.11/14"," 3 + 1"," Single Car Garage & 3 Car Parking"," 1 x 4, 1 x 3, 1 x 2 Piece",null,null," Aug 15, 2014 or tba","Rene Gordon HWA","Donview MHWA","George S Henry Academy"," Roof ‘14"," Furnace with Humidifier ‘12"," Central Air Conditioning ‘07"," 100 Amp Service"," New Kitchen ‘12"," All Windows ‘09"," All Hardwood Flooring ‘12"," Chimneys Rebuilt ‘10"," Updated Bathrooms"," All New Interior Door Hardware ‘14"]
["km000576","SOLD","Condo","60","Aerodrome Crescent, #302",435500,null,"Sought After Leaside Townhome!",null,"EGLINTON/BRENTCLIFFE"," 43°42'52.67\"N"," 79°21'26.35\"W",{"$f":"IF(ISBLANK(K516),\"\",DMS_to_Dec(K516))","v":43.714630555555559},{"$f":"IF(ISBLANK(L516),\"\",DMS_to_Dec(L516))","v":-79.357319444444443},null,null,null,null,null," $2,357.01/2014",2," 1 Underground Spot"," 1 x 4, 1 x 3 Piece"," $308.98/month (includes: parking, common elements, building insurance, snow removal & land landscaping)",null," September 2014/TBA"," Bennington Heights ES"," Bessborough Drive E & MS"," Leaside HS"," Townhome Built in ‘04"," Central Air Conditioning "," 100 Amp Service"," Roof ‘13"," New Bathrooms ’12 & ‘13"," Underground Visitor Parking"," Walking Distance to Lots of Shops & Grocery Stores (Leaside Smart Centres)"," TTC, DVP & Highway 401 at Your Doorstep"," Sunnybrook Park"]
["km000577","SOLD","Condo","21","Hillcrest Avenue",318800,null,"The Best Yet!  Unobstructed Views, Walk-out to an Enormous Terrace "," 100 Walkscore! Walker's Paradise!","YONGE/SHEPPARD"," 43°46'3.39\"N"," 79°24'40.80\"W",{"$f":"IF(ISBLANK(K517),\"\",DMS_to_Dec(K517))","v":43.767608333333335},{"$f":"IF(ISBLANK(L517),\"\",DMS_to_Dec(L517))","v":-79.411333333333346},"http://www.karenmillar.com/spotlight_slideshow.php?id=km000577",null,null,null,null," $2,136.50/2014",1," 1 Underground Spot"," 1 x 4 Piece"," $452.55/mo (includes heat, water, building insurance & common elements)",1," 45 days or tba"," Lillian PS"," Avondale PS"," Woodbine JHS/Georges Vanier SS"," 500 Sq. Ft Terrace"," Corner Suite"," Hunter Douglas Blinds '11","Maple Flooring '11"," Open Concept"," Stainless Steel Appliances '11"," Ensuite Laundry"," First Class Amenities"," 100 out of 100 Walkscore (Walker's Paradise)"," In the Heart of North York"," Steps to Subway, Mel Lastman Square, Loblaws, Restaurants & Theatres"," 24-hour Concierge"]
["km000578","SOLD","Family Residential","53","Stonedale Placeway",678800,null,"This Is A Stunner In The Denlow School District!",null,"LESLIE/YORK MILLS"," 43°45'5.55\"N"," 79°21'42.49\"W",{"$f":"IF(ISBLANK(K518),\"\",DMS_to_Dec(K518))","v":43.751541666666668},{"$f":"IF(ISBLANK(L518),\"\",DMS_to_Dec(L518))","v":-79.361802777777768},"http://www.karenmillar.com/spotlight_slideshow.php?id=km000578",null,null,null,null," $3,329.46/2014","3 + 1"," Single Car Garage & 1 Car Parking"," 1x4, 1x2 Piece"," $470/mo (includes: water, basic cable, landscaping, street & driveway snow removal, building insurance & common elements)",null," September/October/TBA","Denlow PS","Windfields JHS","York Mills CI"," Totally Renovated ‘05"," Very Rare Two Story Unit"," All New Copper Wiring ‘05"," 100 Amp Service"," Some New Plumbing ‘05"," All New Ceilings on Main Floor ‘05"," Furnace Approximately ‘08"," Bathrooms ‘05"," Kitchen ‘05"," New Roof"," Central Air Conditioning"," Upper Floor Laundry"," Backs on to Detached Homes"]
["km000579","LEASE","Condo","1801","O'Connor Drive, # 405",null,1400,"This Spacious & Bright Suite is Ready for You to Move in Immediately! ",null,"VICTORIA PARK/EGLINTON"," 43°43'13.78\"N"," 79°18'14.84\"W",43.720494444444448,-79.304122222222219,"http://www.karenmillar.com/spotlight_slideshow.php?id=km000579",null,null,null,null,null,2," 1 Underground Spot"," 1 x 4 Piece",null,1," Immediate or TBA","O'Connor PS","Gordon A Brown MS/Milne Valley MS","East York CI/Marc Garneau CI"," In Demand Low Rise Cadillac Fairview Building"," Building with Heated Driveway"," Pets Permitted","Suite is Close to Elevator"," Additional Parking for $35/mo"," Steps to Public Transit"," Ensuite Laundry & Separate Laundry Room in Building"," Building Amenities Include:"," Outdoor Pool"," Tennis Court "," Party Room"," Visitor Parking"," Gym"," Sauna"," Recreation Centre & Room"]
["km000580","SOLD","Condo","120","Aerodrome Crescent, #301",528800,null,"Rare And Gorgeous End Unit Townhouse In Sought After Leaside!","Wonderful 3 Bedroom Loft Overlooking The Living And Dining Room!","EGLINTON/BRENTCLIFFE"," 43°42'50.69\"N"," 79°21'19.85\"W",43.714080555555562,-79.355513888888879,"http://www.karenmillar.com/spotlight_slideshow.php?id=km000580",null,null,null,null," $2,888.42/14",3," 2 Parking Spots"," 1x4, 1x3 Piece"," $295.71/month (includes: building insurance, common elements, parking, landscaping & snow removal)",1," 120 Days or tba"," Bennington Heights ES"," Bessborough Drive E & MS"," Leaside HS"," Central Air Conditioning"," 100 Amp Service"," Wired for Security System"," Spacious & Sun Flooded"," Stainless Steel Appliances"," Two Parking Spots"]
["km000581","NEW","Executive","35","Yewfield Crescent",1688000,null,"Rare Opportunity To Move Into A Beautiful Executive 2-Storey In One Of Don Mills' Most Sought After Neighbourhoods.",null,"DON MILLS/LAWRENCE"," 43°44'56.03\"N"," 79°20'41.14\"W",{"$f":"IF(ISBLANK(K521),\"\",DMS_to_Dec(K521))","v":43.748897222222226},{"$f":"IF(ISBLANK(L521),\"\",DMS_to_Dec(L521))","v":-79.344761111111112},"http://www.karenmillar.com/spotlight_slideshow.php?id=km000581",null,null,null," 60 x 110 Feet"," $7,016.80/2014"," 4 + 1"," Single Car Garage & 3 Car Parking"," 1 x 5, 2 x 4, 1 x 3 Piece",null,null," 90 Days/TBA","Greenland PS/Norman Ingram PS","Don Mills MS","Don Mills CI"," Roof ‘05"," All Windows ‘05"," Furnace ‘05"," Central Air Conditioning ‘05"," Central Vacuum"," 200 Amp Service"]
["km000582","ARCHIVE","Executive","2108","Bayview Avenue, #H121",null,null,null,null,"BAYVIEW/LAWRENCE"," 43°43'23.18\"N"," 79°22'46.31\"W",{"$f":"IF(ISBLANK(K522),\"\",DMS_to_Dec(K522))","v":43.723105555555556},{"$f":"IF(ISBLANK(L522),\"\",DMS_to_Dec(L522))","v":-79.379530555555547},"http://www.karenmillar.com/spotlight_slideshow.php?id=km000582",null,null,null,null," $ to be assessed"," 3 + 1"," 1 car parking"," 1 x 4, 1 x 3, 1 x 2 Piece"," ",null," Immediate/TBA"," Blythwood Jr PS"," Glenview Sr PS"," York Mills CI/Northern SS"," Kantelberg designed contemporary kitchen"," Oak hardwood Flooring Throughout"," Granite Kitchen Countertops"," Stainless Steel Appliances"," 9 ft. Ceiling on Main Level"," Garage Access to Garage from Lower Level"," Across from Sunnybrook Hospital"]

{"sheet":"News","index":1,"n_rows":142,"n_cols":7,"rows_kept":142,"cut":false,"hidden":false,"merged":[]}
["Karen Millar News"]
[]
["news_id","type","title","filename","author","source","date"]
["kmnw0001","ECO","Royal LePage Eco Podcast","http://media.bluerush.ca/royallepage/podcast5en/rl_episode_5.html","Royal LePage"]
["kmnw0002","ECO","How Green is your Home?","How_green_is_your_home.pdf","Kathryn Young","CanWest News Service","July 27, 2008"]
["kmnw0003","ECO","Cash In, Turn Out, Drop Off!","Cash_in_turn_out_drop_off.pdf","Andrew Willis","Globe and Mail","April 4, 2008"]
["kmnw0004","ECO","Ten Novel Ways to go Green on Earth Day","10_Novel_Ways_to_go_Green_for_Earth_Day.pdf","Nicole Tomlinson","CTV.ca","April 20, 2008"]
["kmnw0005","ECO","Be a Good Steward","Be_a_Good_Steward.pdf","Matthew Sleeth"]
["kmnw0006","ECO","Consumers Cautiously Keen About Green","Consumers_Cautiously_Keen_About_Green.pdf","Tyler Hamilton",null,"January 20, 2009"]
["kmnw0007","ECO","Ed Begley Acts on his Eco Beliefs","Ed_Begley_Act_on_his_Eco-Beliefs.pdf","Elizabeth Weise","USA Today"]
["kmnw0008","ECO","Have yourself a Green Christmas","Have_Yourself_a_Green_Christmas.pdf","Jim Ball"]
["kmnw0009","ECO","Keeping Green over the Holiday Season","Keeping_Green_Over_the_Holiday_Season.pdf","Sandie Benitah","CTV.ca","December 24, 2007"]
["kmnw0010","ECO","Thornhill Condo will be Green Inside and Out","Thornhill_Condo_Will_be_Green_Inside_and_Out.pdf","Diane Tierney","Toronto Star","January 10, 2009"]
["kmnw0011","ECO","Bill 150 Targets Long-Suffering Homeowner","Bill_150.pdf","Bob Aaron","Yourhome.ca","March 7, 2009"]
["kmnw0012","ECO","Green audits have critics seeing red","Green_Audits.pdf","Rob Ferguson","Yourhome.ca","February 25, 2009"]
["kmnw0013"]
["kmnw0014"]
["kmnw0015"]
["kmnw0016"]
["kmnw0017"]
["kmnw0018"]
["kmnw0019"]
["kmnw0020"]
["kmnw0021"]
["kmnw0022"]
["kmnw0023"]
["kmnw0024"]
["kmnw0025"]
["kmnw0026"]
["kmnw0027"]
["kmnw0028"]
["kmnw0029"]
["kmnw0030"]
["kmnw0031"]
["kmnw0032"]
["kmnw0033"]
["kmnw0034"]
["kmnw0035"]
["kmnw0036"]
["kmnw0037"]
["kmnw0038"]
["kmnw0039"]
["kmnw0040"]
["kmnw0041"]
["kmnw0042"]
["kmnw0043"]
["kmnw0044"]
["kmnw0045"]
["kmnw0046"]
["kmnw0047"]
["kmnw0048"]
["kmnw0049"]
["kmnw0050"]
["kmnw0051"]
["kmnw0052"]
["kmnw0053"]
["kmnw0054"]
["kmnw0055"]
["kmnw0056"]
["kmnw0057"]
["kmnw0058"]
["kmnw0059"]
["kmnw0060"]
["kmnw0061"]
["kmnw0062"]
["kmnw0063"]
["kmnw0064"]
["kmnw0065"]
["kmnw0066"]
["kmnw0067"]
["kmnw0068"]
["kmnw0069"]
["kmnw0070"]
["kmnw0071"]
["kmnw0072"]
["kmnw0073"]
["kmnw0074"]
["kmnw0075"]
["kmnw0076"]
["kmnw0077"]
["kmnw0078"]
["kmnw0079"]
["kmnw0080"]
["kmnw0081"]
["kmnw0082"]
["kmnw0083"]
["kmnw0084"]
["kmnw0085"]
["kmnw0086"]
["kmnw0087"]
["kmnw0088"]
["kmnw0089"]
["kmnw0090"]
["kmnw0091"]
["kmnw0092"]
["kmnw0093"]
["kmnw0094"]
["kmnw0095"]
["kmnw0096"]
["kmnw0097"]
["kmnw0098"]
["kmnw0099"]
["kmnw0100"]
["kmnw0101"]
["kmnw0102"]
["kmnw0103"]
["kmnw0104"]
["kmnw0105"]
["kmnw0106"]
["kmnw0107"]
["kmnw0108"]
["kmnw0109"]
["kmnw0110"]
["kmnw0111"]
["kmnw0112"]
["kmnw0113"]
["kmnw0114"]
["kmnw0115"]
["kmnw0116"]
["kmnw0117"]
["kmnw0118"]
["kmnw0119"]
["kmnw0120"]
["kmnw0121"]
["kmnw0122"]
["kmnw0123"]
["kmnw0124"]
["kmnw0125"]
["kmnw0126"]
["kmnw0127"]
["kmnw0128"]
["kmnw0129"]
["kmnw0130"]
["kmnw0131"]
["kmnw0132"]
["kmnw0133"]
["kmnw0134"]
["kmnw0135"]
["kmnw0136"]
["kmnw0137"]
["kmnw0138"]
["kmnw0139"]

{"sheet":"Tips","index":2,"n_rows":202,"n_cols":4,"rows_kept":202,"cut":false,"hidden":false,"merged":[]}
["Karen Millar Tips"]
[]
["tips_id","type","text","length"]
["kmtp0001","ECO","Sensors turn lights on when motion is sensed, making them great for storerooms, basements and entrances, reducing lighting consumption up to 30%.  Businesses find sensor lights most helpful in storage and loading\nareas when you might not have a hand free to turn on the lights.",{"$f":"LEN(C4)","v":277}]
["kmtp0002","ECO","Programmable thermostats are easy to install and can reduce your heating and cooling bills up to 10% a year. Programmable thermostats are easily available at hardware stores and cost under $100.",194]
["kmtp0003","ECO","Trees purify the air in addition to providing shade in the summer and shelter from cold winter winds. Visit your local garden centre to find out which trees would suit your site.",178]
["kmtp0004","ECO","Reversible ceiling fans push down hot air in winter and ventilate in summer by pulling hot air up.  A ceiling fan can lower the temperature by about 2 degrees Celsius. They're especially well-sited to rooms with high ceilings.",226]
["kmtp0005","ECO","Shades, drapes and interior shutters help reduce heat loss at night and can block sunlight during the day. Don't underestimate the impact closing your drapes or shades can have on cutting air-conditioning and heating bills.",223]
["kmtp0006","ECO","Shades, drapes and interior shutters help reduce heat loss at night and can block sunlight during the day. Don't underestimate the impact closing your drapes or shades can have on cutting air-conditioning and heating bills.",223]
["kmtp0007","ECO","Weather-strip doors; weather- stripping kits are easily available at hardware stores. Commercial (metal) doors may require specialty weather stripping.",151]
["kmtp0008","ECO","All those tiny gaps and cracks in an older building can add up to a one-foot square hole. You can save up to 40% on heating and cooling by filling them in - its easy to do and very inexpensive.",193]
["kmtp0009","ECO","One of the easiest ways to save energy is to turn off lights and appliances when you're not using them.",103]
["kmtp0010","ECO","Timers save money both at home and in commercial buildings by automatically switching off lights at specified times.",116]
["kmtp0011","ECO","Double-paned glass in new doors and windows may cost more initially, but can reduce heating costs by 34% in cold climates and save 38% on summer cooling.",153]
["kmtp0012","ECO","Fill oddly shaped gaps with fiberglass insulation, or spray foam, which can be cut and painted after it hardens.",112]
["kmtp0013","ECO","Have your utility, cell phone and all other bills or invoices sent to you via email instead of wasting paper.",109]
["kmtp0014","ECO","Getting good dirt. Organic farming methods keep soil in good shape for future generations. ",91]
["kmtp0015","ECO","Among other health benefits, consuming more fruit can lower your stroke risk by 31%, and eco versions don't contain the \"relatively high\" amount of pesticide residue found in many juices (according to an international study).\n",226]
["kmtp0016","ECO","Chipping away at energy waste. Example: Each time you open the oven for a peek, it loses up to 25% of its heat.",111]
["kmtp0017","ECO","More dough in your wallet. You'll save on energy bills when you do things like turning off the oven a few minutes early. The heat retained inside should finish the job fine.",173]
["kmtp0018","ECO","Quicker cookie eating. Your bake job'll go faster if you don't wait to preheat. Unless you're baking cakes or pastries, it's usually unnecessary",144]
["kmtp0019","ECO","Baking yourself warm. When you're done, open the oven and let the extra heat warm your house. ",94]
["kmtp0020","ECO","Make the Pact - agree that less is more among your peeps. At the very least, pledge to share wish lists, so everyone gets presents they'll use. \nFreecycle and Craigslist - post stuff you don't want online; most likely, someone else will want it.",245]
["kmtp0021","ECO","Put out feed. Make a feeder by cutting a large opening in a clean, plastic juice bottle and hang it by its handle. Sunflower seeds attract the most types of birds. And don’t put out baked goods, which are bad for birds. ",220]
["kmtp0022","ECO","Make a commitment. Putting bird feed out in winter requires a long-term commitment because wildlife becomes dependent upon it. This is especially important during bad weather and after snow storms.",197]
["kmtp0023","ECO","Hang nesting material – birds love wood shavings, short lengths of yarn, burlap threads, wool, cotton batting, or furniture stuffing. Avoid mesh bags that birds may become entangled in. ",186]
["kmtp0024","ECO","Put up a birdhouse – especially important in neighbourhoods with few wooded areas. Place it out of reach of cats and clean it out in the fall. If you build your own, remember to follow dimensions, exactly for each species.",222]
["kmtp0025","ECO","Grow native (or naturalized) trees, shrubs, plants. They provide shelter, places to raise young, and food sources. White Cedar and White Spruce provide year-round green and good cover. No yard? Try planters.",207]
["kmtp0026","ECO","Stay close to home. Plants native to Canada are the best choice because they are hardy require less watering and little maintenance, attract beneficial insects, and have evolved with local wildlife.",198]
["kmtp0027","ECO","Put out a bird bath. This is especially important in winter because most natural water sources are frozen. A plant saucer with textured finish and a stone in the middle is good. Avoid metal in winter. Use hot water to melt ice rather than breaking it into sharp pieces.",269]
["kmtp0028","ECO","Make a conscious effort to buy goods that use minimal or no packaging. Bring and use cloth bags when shopping. Reuse or recycle plastic products. ",146]
["kmtp0029","ECO","Buy laundry ‘soap’ instead of detergent; Borax or washing soda instead of bleach; baking soda and vinegar instead of drain cleaner.",131]
["kmtp0030","ECO","Purchase energy- and water-efficient appliances. ",49]
["kmtp0031","ECO","Try organic fertilizers or natural solutions like sprinkling lawns with grass clippings, topsoil or compost to improve soil, thereby avoiding the need for fertilizer. ",167]
["kmtp0032","ECO","Keep the coils clear of collected dirt to keep your refrigerator running efficiently. Find the narrow nozzle accessory for your vacuum cleaner and attach it to the hose. Make sure you un-plug your refrigerator before you do this. ",230]
["kmtp0033","ECO","Prevent  your refrigerator door from leaking valuable cold air. To test, close the door on a dollar bill, then see how easy it is to remove the  bill.  If easy, replace seals to maximize insulation of the refrigerator. ",219]
["kmtp0034","ECO","Maximize air circulation around your refrigerator. Keep a few inches of space between the refrigerator, cabinets and countertops. ",130]
["kmtp0035","ECO","Set the refrigerator temperature between 35 and 38 degrees Fahrenheit and the freezer temperature at 0 degrees. Temperatures any colder can use 25% or more energy and are not necessary for keeping food cool. ",208]
["kmtp0036","ECO","Full (but not overstuffed) refrigerators help the refrigerator recover more easily from opening the door. If you do not have much food in your refrigerator, place containers full of water inside in order to have the same efficiency as a full refrigerator. ",256]
["kmtp0037","ECO","Choose your food before opening the refrigerator door. If you think about what you want to eat or drink prior to opening the door, you can shut the door faster and release less cold air. ",187]
["kmtp0038","ECO","Replace home light bulbs with compact fluorescent bulbs or LEDs to decrease the energy used by approximately 90%.",113]
["kmtp0039","ECO","Replace your home appliances with Energy Star rated appliances if possible to use approximately 20 to 40% less energy. ",119]
["kmtp0040","ECO","A Programmable thermostat moderates the temperature of your home so that it can turn off the air while you are away and have it still be cool or warm when you return. This can greatly decrease the amount of energy that is used to keep your home at your ideal temperature. ",272]
["kmtp0041","ECO","Rather than using regular air filters, use green air filters for your air conditioning system to increase air quality and air conditioning efficiency. ",151]
["kmtp0042","ECO","A HEPA air filtration unit in your home increases air quality and decreases air particles that can cause your air conditioning to use more energy. ",147]
["kmtp0043","ECO","If you are going to repaint your walls, use low volatile organic compounds, aka low-VOC, paints to increase air quality. ",121]
["kmtp0044","ECO","Dual flush toilets decrease the amount of water used in your home decrease the amount of water used compared to a normal toilet by around 25%.",142]
["kmtp0045","ECO","Use recycled materials to make over your kitchen floors and cabinets! There are many environmentally friendly options including: reclaimed wood, bamboo, cork, and natural linoleum, which is made out of flax seed, linseed oil and other biodegradable materials.",259]
["kmtp0046","ECO","Home composting systems, specifically for indoor use, because if you live in an apartment or condo…you probably do not have a yard where you can keep a compost pile. ",166]
["kmtp0047","ECO","Why need power if you're not around to use your electric appliances? Smart surge moderators have two outlets that always stay on, while the other outlets turn off throughout the day and night to save energy. Models differ by features and price, but overall they are a great way to reduce energy usage at home! ",310]
["kmtp0048","ECO","Showers save hot water – a typical bath uses approximately 75 litres of hot water, while a 5 minute shower with an efficient showerhead will use about half of that.",164]
["kmtp0049","ECO","Be sure to use the vacation setting or turn off your hot water heater when you are out of town.",95]
["kmtp0050","ECO","Fix leaky faucets – that little drop can add up to 95 liters of water per faucet per month and cost you 7kWh per month.",119]
["kmtp0051","ECO","Installing low flow aerators on faucets can save water and energy.",66]
["kmtp0052","ECO","Wrapping your electric water heater in a special tank blanket can reduce its electricity use.",93]
["kmtp0053","ECO","Don’t let freezers build up more than 6 mm of frost. Defrost regularly to keep freezers working their best.",107]
["kmtp0054","ECO","Don’t keep that old, inefficient refrigerator running in the basement for occasional refreshments. It could cost you $150 or more per year in electricity.",154]
["kmtp0055","ECO","When using the stove, be sure to put lids on pots in order to keep the heat in the pot, which enables you to use lower heat settings.",133]
["kmtp0056","ECO","Try to operate your dishwasher with a full load and use the energy-saving cycle.",80]
["kmtp0057","ECO","Don’t waste hot water by pre-rinsing dishes before putting them in your dishwasher. Just scrape off food and empty liquids.",123]
["kmtp0058","ECO","Air dry your dishes – you can save 10% of the cost of operation.",64]
["kmtp0059","ECO","Use eco-friendly and careful washing techniques.  Use the lowest washing temperature possible; only wash full loads; use phosphate-free and biodegradable detergents; air dry rather than using the clothes dryer. ",211]
["kmtp0060","ECO","Wear organic fibres. Cotton is one of the most petrochemical-intensive forms of textile production. Look instead for organic cotton.  Become knowledgeable about labels and support stores which sell clothing made from certified organic materials.",{"$f":"LEN(C63)","v":245}]
["kmtp0061","ECO","Buy “re-purpose garments”. A repurpose garment is one made up from previously used materials, i.e. a purse made from old blue jeans.",{"$f":"LEN(C64)","v":132}]
["kmtp0062","ECO","Purchase clothing which is manufactured under fair labour practices. Watch for labels which advertise this fact.",112]
["kmtp0063","ECO","Donate your old clothing to shelters and other charities. Do not let it become part of the land-fill problem",108]
["kmtp0064","ECO","Pack a litterless lunch!",24]
["kmtp0065","ECO","Avoid using chemical fertilizers or pesticides on your lawn or garden.  Learn about natural methods of insect control like companion planting and natural non-toxic recipes.",172]
["kmtp0066","ECO","Make sure clothes are effectively wrung before putting them in the dryer.  ",75]
["kmtp0067","ECO","Separate loads of clothes into heavy, medium and lightweight items – lighter loads will take less drying time than a mixture of items.",134]
["kmtp0068","ECO","Clean the lint filters in your dryer after every load because a clogged filter can increase energy use up to 30% and may be a fire hazard!",138]
["kmtp0069","ECO","Be sure to shut off the computer screen as 60% of the power used by a computer is used by the monitor! (Both the screen and computer hard drive should always be turned off when not in use)",188]
["kmtp0070","ECO","Use a solar blanket to keep swimming pool water warm overnight and use your heater only when necessary.",103]
["kmtp0071","ECO","Green your pets! Feed your pets organic pet foods, clean up after your pets, buy toys made from sustainable goods, use natural pet care and cleaning products and on the winter months use eco friendly ice melting products.",221]
["kmtp0072","ECO","Lug a mug – bring your own mug/cup for your hot and cold drinks on the go.",74]
["kmtp0073","ECO","Bag it – Bring your own reusable cloth bags when you go shopping",64]
["kmtp0074","ECO","Reuse egg cartons – Take your egg cartons to a farmers market so that they can be reused, or get the kids to use them for art projects.",135]
["kmtp0075","ECO","Ride the Rocket – Take public transportation or ride a bike instead of using the car whenever possible.",103]
["kmtp0076","ECO","Make the most of a rainy day – Collect rainwater in a barrel and use it to water garden or patio plants or to wash your car. Just make sure that the barrel is covered with screening to prevent small mammals from getting stuck in the barrels. ",242]
["kmtp0077","ECO","Juice do it: Avoid pesticides in both your diet and the soil with eco-friendlier juices.",88]
["kmtp0078","ECO","Pack lunches in reusable containers. Buy a reusable mug. Avoid disposable products.",83]
["kmtp0079","ECO","Look for products labeled with the ‘Ecologo’. Buy local goods which support your community and reduce transportation pollution. ",128]
["kmtp0080","ECO","Repair leaky faucets and install flow restrictors. ",51]
["kmtp0081","ECO","Turn off the water while shaving or brushing your teeth. ",57]
["kmtp0082","ECO","Take short showers, not full baths. ",36]
["kmtp0083","ECO","Only run the dishwasher or washing machine with a full load. ",61]
["kmtp0084","ECO","Don’t water your lawn during the heat of the day. Even better, replace grass with native ground covers that won’t require watering or mowing. ",142]
["kmtp0085","ECO","Get rid of insects with a spray mixture of 15ml (3tsp) liquid soap in 1 litre (4 cups) of water. If it says ‘-cide’ on the bottle, don’t use it or buy it. Poisons from pesticides, herbicides, fungicides and insecticides get washed into waterways and ingested into the food chain. ",280]
["kmtp0086","ECO","If you desire new kitchen countertops there are many options including recycled bottles and glass, reclaimed wood, stone, and metal. Icestone is one example of a company that is known for their beautiful and unique countertops made from recycled glass.",252]
["kmtp0087","ECO","Avoid phosphate-containing detergents and cleaning supplies – they enter the waterways and cause explosive algae growth, which robs aquatic species of oxygen when it decomposes. ",178]
["kmtp0088","ECO","Opt for a green hotel, where you will get efficient lighting and water fixtures, alternative-fuel service vehicles & recycling. Help decrease the $3.7 billion per year the hospitality industry spends on energy. Some hotels use green cleaning supplies that minimize workers' exposure to toxic chemicals. Progressive hotels support habitat conservation programs and donate partially used soap and shampoo to people who can use it.",428]
["kmtp0089","ECO","The number of trees that go in to making receipts is just plain criminal. Stop requesting a receipt at the ATM, gas pump, checkout stand, and anywhere else where you have the choice. Receipts from the 8 billion ATM transactions each year create a lot of waste - and most end up in the trash. You can view all your transactions on your bank's website, and some stores, such as Apple, will send an e-receipt to your email. ",421]
["kmtp0090","ECO","The best way to wash your produce: Use water and white vinegar. A few squirts on your fruits and veggies will wash away the nasty pesticide residue.  A diluted vinegar rinse kills 98% of bacteria on produce - researchers found it works even better than a scrub brush. Buying plastic bottles of produce wash means having to recycle them too (not to mention the energy and materials needed to make and ship them in the first place) - you'll still need to buy bottles of vinegar, but you'll buy fewer of them.",506]
["kmtp0091","ECO","Try to recycle your toilet paper tubes. A little tube goes a long way. A family of four uses about 240 rolls per year - add up all those tubes, and it's a lot of landfill space.",177]
["kmtp0092","ECO","Glass and stainless steel drinking straws add garbage-free class to your glass.\nMost disposable straws are made from polypropylene (so you can recycle them), but remember: plastic never fully biodegrades, so generally just try to avoid it.\n",240]
["kmtp0093","ECO","You will love cast iron cookware. With a little heat, these iron maids perform just as well as or better than Teflon options, without all the health question marks. Foods cooked in cast iron absorb valuable iron that's good for your health. Cast iron pans (at about $25) are a fraction of the cost of many nonstick pans (which can cost you $50 and up), and they last forever. When seasoned properly, cast iron pans are as nonstick as the usual options, but without the chemical polytetrafluoroethylene (PTFE), a likely carcinogen according to the EPA.",551]
["kmtp0094","ECO","Unless you are printing something important, save ink and paper by using Draft Mode and, if you can, print double-sided. Each year, the world's discarded cartridges, stacked end-to-end, could circle the planet three times. If you print double-sided, you will buy half as much paper, and if you print 100 pages in Draft Mode instead of regular mode, you will save as much as $2 on ink. ",385]
["kmtp0095","ECO","Use digital desktop notes that act as reminders on your laptop or phone instead of Post-its. They are free, tree-free, and never lose their stickiness.",151]
["kmtp0096","ECO","Staining a deck? Use natural-based wood treatments (for indoors and out) that leave unhealthy synthetic chemicalss in the dust. At some point, chemical based finishes will wash off into the environment, which is far less of a problem if they are made with ingredients like vegetable oils, rather than the usual petrochemicals.\nYou are safe to use them on food surfaces like cutting boards. Eco-sealants may need twice as many coats as conventional stains to be totally water-resistant. Try\nAFM DuroStain or WaterShield clear, waterproofing sealer ($35-$79/gallon).\nPoor Richard's Woodserve - great for furniture and cooking surfaces (such as cutting boards); made with fruit oils and recycled vegetable oils ($35/gallon).",721]
["kmtp0097","ECO","Use the Diamond Lanes for car pooling: Clinical studies show that using the diamond lane prevents up to 790 pounds of greenhouse gases per person each year. Yep - 790 greenhouses.",179]
["kmtp0098","ECO","If you have a tank water heater, turn down the temperature a little to save major energy ",89]
["kmtp0099","ECO","Weeds in your garden can be fought with eco-friendly herbicides that keep weeds away. vinegar-based spray formulas for instance are $8/32 ounces.",145]
["kmtp0100","ECO","Opt for a reel or electric mower instead of a high-polluting gas-powered one.",77]
["kmtp0101","ECO","Attention all takeout fiends - try cooking a meal at home once a week to cut down on trash.",91]
["kmtp0102","ECO","Try eco hair dyes next time you wanna change your hair",54]
["kmtp0103","ECO","Use baby pacifiers and teethers free of the problem chemical bisphenol A (BPA) that soothes baby gums without causing any eco-resentment. ",138]
["kmtp0104","ECO","Pool Covers: Your own special heating agent! Solar pool covers attract and store heat from the sun's rays to help raise the water temperature (from 10-15 degrees) and can save you up to 70% on heating costs. Covers reduce the amount of water lost to evaporation by up to 50%.",275]
["kmtp0105","ECO","Using the air conditioner less cuts carbon dioxide emissions. Cooling costs take up 12% of all the energy we use, contributing to rolling brownouts during the summer.\nBy cutting back on the electricity required to run the air conditioner, less money goes to the electric company meaning more in your pocket (up to $98 per year).\n",329]
["kmtp0106","ECO","Save with your sprinkler system with moisture sensors. They tell your sprinklers to spray only when your garden's dry (and save you up to 40% of your outdoor water use), while rain sensors shut your sprinklers off when it rains (saving you up to 10%). You are not only conserving water but you will also notice a difference on your water bill.",343]
["kmtp0107","ECO","A slow drip on your tap can waste more than 100 gallons of water per week.",74]
["kmtp0108","ECO","When dining out, ask your server not to bring water to the table if you are not going to drink it. Many restaurants serve water unnecessarily, so say \"no thanks\" and help quench your water use, one glass at a time. For every 8-ounce glass of water not served, we save 1.5 to 3 gallons, since making water drinkable takes water itself (during the treatment process).",365]
["kmtp0109","ECO","A typical piece of produce travels 1,500 miles from farm to plate; local strawberries and lettuce (try your local farmers market) - require less gas to get to you.\nLocal food almost always means fresher food.\n",209]
["kmtp0110","ECO","Try and use eco fishing equipment made with safe materials instead of lead based products. Opt for eco-friendlier poles and line made from bamboo, steel, and plant-based polymers (instead of petroleum-based synthetic graphite, poisonous lead, and non biodegradable plastic).",274]
["kmtp0111","ECO","This summer you can save up to 40% on air conditioning and 10% on heating in the winter by managing air flow with a ceiling fan (that's up to $10/month).\nMost ceiling fans use only about as much power as a 100-watt incandescent bulb. Running your fan counterclockwise in summer directs air downward and creates a breeze; in the winter, running it clockwise will force cold air upward and warm air down.\n",403]
["kmtp0112",null,null,0]
["kmtp0113",null,null,0]
["kmtp0114",null,null,0]
["kmtp0115",null,null,0]
["kmtp0116",null,null,0]
["kmtp0117",null,null,0]
["kmtp0118",null,null,0]
["kmtp0119",null,null,0]
["kmtp0120",null,null,0]
["kmtp0121",null,null,0]
["kmtp0122",null,null,0]
["kmtp0123",null,null,0]
["kmtp0124",null,null,0]
["kmtp0125",null,null,{"$f":"LEN(C128)","v":0}]
["kmtp0126",null,null,0]
["kmtp0127",null,null,0]
["kmtp0128",null,null,0]
["kmtp0129",null,null,0]
["kmtp0130",null,null,0]
["kmtp0131",null,null,0]
["kmtp0132",null,null,0]
["kmtp0133",null,null,0]
["kmtp0134",null,null,0]
["kmtp0135",null,null,0]
["kmtp0136",null,null,0]
["kmtp0137",null,null,0]
["kmtp0138",null,null,0]
["kmtp0139",null,null,0]
["kmtp0140",null,null,0]
["kmtp0141",null,null,0]
["kmtp0142",null,null,0]
["kmtp0143",null,null,0]
["kmtp0144",null,null,0]
["kmtp0145",null,null,0]
["kmtp0146",null,null,0]
["kmtp0147",null,null,0]
["kmtp0148",null,null,0]
["kmtp0149",null,null,0]
["kmtp0150",null,null,0]
["kmtp0151",null,null,0]
["kmtp0152",null,null,0]
["kmtp0153",null,null,0]
["kmtp0154",null,null,0]
["kmtp0155",null,null,0]
["kmtp0156",null,null,0]
["kmtp0157",null,null,0]
["kmtp0158",null,null,0]
["kmtp0159",null,null,0]
["kmtp0160",null,null,0]
["kmtp0161",null,null,0]
["kmtp0162",null,null,0]
["kmtp0163",null,null,0]
["kmtp0164",null,null,0]
["kmtp0165",null,null,0]
["kmtp0166",null,null,0]
["kmtp0167",null,null,0]
["kmtp0168",null,null,0]
["kmtp0169",null,null,0]
["kmtp0170",null,null,0]
["kmtp0171",null,null,0]
["kmtp0172",null,null,0]
["kmtp0173",null,null,0]
["kmtp0174",null,null,0]
["kmtp0175",null,null,0]
["kmtp0176",null,null,0]
["kmtp0177",null,null,0]
["kmtp0178",null,null,0]
["kmtp0179",null,null,0]
["kmtp0180",null,null,0]
["kmtp0181",null,null,0]
["kmtp0182",null,null,0]
["kmtp0183",null,null,0]
["kmtp0184",null,null,0]
["kmtp0185",null,null,0]
["kmtp0186",null,null,0]
["kmtp0187",null,null,0]
["kmtp0188",null,null,0]
["kmtp0189",null,null,{"$f":"LEN(C192)","v":0}]
["kmtp0190",null,null,0]
["kmtp0191",null,null,0]
["kmtp0192",null,null,0]
["kmtp0193",null,null,0]
["kmtp0194",null,null,0]
["kmtp0195",null,null,0]
["kmtp0196",null,null,0]
["kmtp0197",null,null,0]
["kmtp0198",null,null,0]
["kmtp0199",null,null,0]

{"sheet":"Trades","index":3,"n_rows":186,"n_cols":13,"rows_kept":186,"cut":false,"hidden":false,"merged":[]}
["Karen Millar Trades"]
[]
["company_id","trade_id","type_type","company","contact","address_01","address_02","info_01","info_02","info_03","info_04","email","web"]
["kmtr0001","t01","Banks/Mortgages","Dominion Lending","Carolyn Dunlop - Mortgage Consultant","49 The Donway West","Toronto, ON M3C 3M9","Tel:  416-443-0300",null,"Pager:  416-609-7099","Fax:  416-386-1375"]
["kmtr0002",{"$f":"VLOOKUP(C5,Lookups!$E$2:$F$26,2,FALSE)","v":"t01"},"Banks/Mortgages","TD Bank – Residential Mortgages","Judy Maddigan - Manager",null,null,"Tel:  416-860-8292","Cell:  416-878-5839",null,null,"Judy.maddigan@td.com","www.tdcanadatrust.com/msf/judymaddigan"]
["kmtr0003",{"$f":"VLOOKUP(C6,Lookups!$E$2:$F$26,2,FALSE)","v":"t01"},"Banks/Mortgages","Tom Miocevich - Mortgage Agent",null,"8 Sampson Mews, 201","Toronto, ON M3C 0H5","Tel:  416-569-7283","Fax: 416-850-4325",null,null,"tom@tommiocevich.com","www.tommiocevich.com"]
["kmtr0004",{"$f":"VLOOKUP(C7,Lookups!$E$2:$F$26,2,FALSE)","v":"t03"},"Floors","City East",null,"Show room:  111 Industrial Drive Unit 9 & 10","Whitby, ON L1N 5Z9","Tel:  905-668-2559 or 1-800-656-9964",null,null,"Fax:  905-668-7205"]
["kmtr0005",{"$f":"VLOOKUP(C8,Lookups!$E$2:$F$26,2,FALSE)","v":"t03"},"Floors","Benchmark Carpet","Daryl","1279 Kennedy Road","Scarborough, ON M1P 2L4","Phone:  416.752.5554",null,null,"FAX:  416-752-5597"]
["kmtr0006",{"$f":"VLOOKUP(C9,Lookups!$E$2:$F$26,2,FALSE)","v":"t04"},"Foundations","Gerardo","Tel: 647-220-2716"]
["kmtr0007",{"$f":"VLOOKUP(C10,Lookups!$E$2:$F$26,2,FALSE)","v":"t05"},"Home Inspectors","Aiken Home Inspections","Scott Aiken","Tel:  416-407-4663"]
["kmtr0008",{"$f":"VLOOKUP(C11,Lookups!$E$2:$F$26,2,FALSE)","v":"t05"},"Home Inspectors","All Seasons Home Insp.","John Tackaberry","81 Ferris Road","East York, ON M4B1G5","Tel:  416-752-4663",null,null,"Fax:  416-752-0651","allseasons@rogers.com"]
["kmtr0009",{"$f":"VLOOKUP(C12,Lookups!$E$2:$F$26,2,FALSE)","v":"t05"},"Home Inspectors","Baker Street","Jeff Clarke","3335 Yonge Street, Suite 402","Toronto, Ontario, M4N 2M1","Tel:  416-483-3535",null,null,"Fax:  416-483-9756","info@bakerstreet-hi.com"]
["kmtr0010",{"$f":"VLOOKUP(C13,Lookups!$E$2:$F$26,2,FALSE)","v":"t05"},"Home Inspectors","Carson & Dunlop","David C. Kee","120 Carlton Street, Suite 407","Toronto, ON  M5A 4K2","Tel:  416-964-9415","Toll Free: 1-800-268-7070",null,"Fax:  416-964-0683","david.kee@carsondunlop.com","www.carsondunlop.com"]
["kmtr0011",{"$f":"VLOOKUP(C14,Lookups!$E$2:$F$26,2,FALSE)","v":"t05"},"Home Inspectors","Claude Michaud & Associates Inc.","Claude Michaud","180 Wheeler Avenue","Toronto, ON  M4L 3V4","Tel:  416-409-8162",null,null,"Fax:  416-686-4496","neville_michaud@rogers.com"]
["kmtr0012",{"$f":"VLOOKUP(C15,Lookups!$E$2:$F$26,2,FALSE)","v":"t05"},"Home Inspectors","Ken Haller Home Inspection Inc.","Tel:  416-465-8236"]
["kmtr0013",{"$f":"VLOOKUP(C16,Lookups!$E$2:$F$26,2,FALSE)","v":"t05"},"Home Inspectors","National Home Insp.","Richard Gaughan","1055 Woodbine Ave.","Toronto, ON M4C 4C2","Tel:  416-467-7809"]
["kmtr0014",{"$f":"VLOOKUP(C17,Lookups!$E$2:$F$26,2,FALSE)","v":"t05"},"Home Inspectors","Peter Yeates Inspections","174 Moore Ave., Toronto, ON M4T 1V8","Tel:  416-422-1571","www.yeatesinspection.com"]
["kmtr0015",{"$f":"VLOOKUP(C18,Lookups!$E$2:$F$26,2,FALSE)","v":"t06"},"Junk Removal","Junk-Out (Junk and debris removal, demolitions)","Henrique (Henry)Vieira","8 Nordin avenue","Toronto, ON  M8Z 2B1","Tel: 416-253-7533",null,null,null,null,"www.junkout.ca"]
["kmtr0016",{"$f":"VLOOKUP(C19,Lookups!$E$2:$F$26,2,FALSE)","v":"t06"},"Junk Removal","Got Junk",null,null,null,"1-800-GOT-JUNK (1-800-468-5865)"]
["kmtr0017",{"$f":"VLOOKUP(C20,Lookups!$E$2:$F$26,2,FALSE)","v":"t07"},"Labour","Rent-A-Son (Will do any kind of labour, painting, etc)","Dustin",null,null,"Tel: 416-913-9021"]
["kmtr0018",{"$f":"VLOOKUP(C21,Lookups!$E$2:$F$26,2,FALSE)","v":"t08"},"Lawyers","Devry Smith Frank Lawyers & Mediators","95 BARBER GREENE RD. #100","Toronto, On","M3C 3E9","Tel;  416-449-1400",null,"Fax:  416-449-7071",null,null,"www.devrylaw.ca"]
["kmtr0019",{"$f":"VLOOKUP(C22,Lookups!$E$2:$F$26,2,FALSE)","v":"t08"},"Lawyers","GRIFFITHS, JONATHAN","SUITE 710, 18 WYNFORD DRIVE","TORONTO, ONT. ","M3C 3S2","TEL:  416-441-1253","FAX: 416-441-9757","EMAIL: jonathan@griffithslaw.com","WEB: www.griffithslaw.com"]
["kmtr0020",{"$f":"VLOOKUP(C23,Lookups!$E$2:$F$26,2,FALSE)","v":"t08"},"Lawyers","BAKER, MARK","130 ADELAIDE STREET WEST. SUITE 3300","TORONTO, ONT.","M5H 3P5","TEL: 416-777-0100","FAX:  416-366-3992",null,null,"mbaker@bakerlawyers.com","www.bakerlawyers.com"]
["kmtr0021",{"$f":"VLOOKUP(C24,Lookups!$E$2:$F$26,2,FALSE)","v":"t08"},"Lawyers","KASSABIAN, GAREN","8 Sampson Mews, 2nd Floor","TORONTO, ONT.","M3C 0H5","TEL:  416-443-9494","FAX:  416-443-0575"]
["kmtr0022",{"$f":"VLOOKUP(C25,Lookups!$E$2:$F$26,2,FALSE)","v":"t08"},"Lawyers","LYCHOWYD, LARRY","236A BAIN AVE. ","TORONTO, ONT.","M4K 1G3","TEL:  416-466-8063 ","FAX:  416-466-9589"]
["kmtr0023",{"$f":"VLOOKUP(C26,Lookups!$E$2:$F$26,2,FALSE)","v":"t08"},"Lawyers","MOORE, GRANT","85 SCARSDALE ROAD","TORONTO, ON M3H 6A7","TEL:  416-493-4148","FAX:  416-493-3979",null,null,null,"general@moore-costello.com"]
["kmtr0024",{"$f":"VLOOKUP(C27,Lookups!$E$2:$F$26,2,FALSE)","v":"t09"},"Mold","Mold Inspections.ca","Tara Valley","Mold inspections","Indoor air quality","Asbestos and lead","Tel:  416-575-6111","Toll Free:  1-866-310-4219",null,"info@moldinspections.ca","www.moldinspections.ca"]
["kmtr0025",{"$f":"VLOOKUP(C28,Lookups!$E$2:$F$26,2,FALSE)","v":"t09"},"Mold","Sick Building Solutions","Jackie Hammill","204 Brown's Line","Etobicoke, ON  M8W 3T4","Tel:  416-259-8833","Fax:  416-259-4974",null,null,"info@sickbuildingsolutions.com"]
["kmtr0026",{"$f":"VLOOKUP(C29,Lookups!$E$2:$F$26,2,FALSE)","v":"t10"},"Movers","Able Movers",null,null,null,"Tel:  416-782-2617"]
["kmtr0027",{"$f":"VLOOKUP(C30,Lookups!$E$2:$F$26,2,FALSE)","v":"t10"},"Movers","AMJ Campbell","Gary Kofoed",null,null,"Tel: (905) 795-3785"]
["kmtr0029",{"$f":"VLOOKUP(C31,Lookups!$E$2:$F$26,2,FALSE)","v":"t11"},"Oil Tank Removal","Atomic Fuels","Igor",null,null,"Tel:  416-252-3399","Basic tank: $250 empty (to cut up + $50)","Less than half full $150 to pump","More than half full Free"]
["kmtr0031",{"$f":"VLOOKUP(C32,Lookups!$E$2:$F$26,2,FALSE)","v":"t11"},"Oil Tank Removal","Gibson Removals","Larry","Scrap removal, oil tanks, boilers, furnaces, pipes, rads, etc",null,"Tel:  905-722-6770","Pager:  416-390-0453 "]
["kmtr0032",{"$f":"VLOOKUP(C33,Lookups!$E$2:$F$26,2,FALSE)","v":"t12"},"Painters","Bruce McDonald (Fireman)",null,null,null,"Tel:  416-985-7208"]
["kmtr0033",{"$f":"VLOOKUP(C34,Lookups!$E$2:$F$26,2,FALSE)","v":"t12"},"Painters","Colour Coat Painters Service",null,null,null,"Tel:  416-431-6462","Cell:  416-419-3572"]
["kmtr0034",{"$f":"VLOOKUP(C35,Lookups!$E$2:$F$26,2,FALSE)","v":"t12"},"Painters","Frank's Painting & Decorating","Frank Magill",null,null,"Cell:  416-268-6596",null,null,null,"frankmagill2@gmail.com"]
["kmtr0035",{"$f":"VLOOKUP(C36,Lookups!$E$2:$F$26,2,FALSE)","v":"t12"},"Painters","Larry's Painting","Larry Bonifacio - President","(They work primarily east of Yonge St. and south of the 401).",null,"Tel:  416-690-3890 ",null,null,null,null,"www.larrys-painting.com"]
["kmtr0036",{"$f":"VLOOKUP(C37,Lookups!$E$2:$F$26,2,FALSE)","v":"t12"},"Painters","Millennium Excellent Painting Services","Laura or Juan Jose Rivero ","624-265 Cassandra Blvd.","North York, ON  M3A 1V4","Tel:  416-444-5549","Cell:  416-824-6317",null,null,"onerivero@yahoo.ca"]
["kmtr0037","t12","Painters","College Pro (Cheap and Cheerful)",null,null,null,"Tel: 1-800-327-2468"]
["kmtr0038",{"$f":"VLOOKUP(C39,Lookups!$E$2:$F$26,2,FALSE)","v":"t13"},"Pest Control","AETNA",null,null,null,"Tel:  416-469-4111"]
["kmtr0039",{"$f":"VLOOKUP(C40,Lookups!$E$2:$F$26,2,FALSE)","v":"t13"},"Pest Control","ESG Environmental Group",null,null,null,"Tel:  416-575-6111","Toll Free:  1-866-310-4219",null,null,null,"www.environmentalservicesgroup.ca"]
["kmtr0040",{"$f":"VLOOKUP(C41,Lookups!$E$2:$F$26,2,FALSE)","v":"t13"},"Pest Control","Purity Pest Control Limited (Dog smells out pests)","Michael Goldman - General Manager","371 Bradwick Drive, Unit 3","Concorde, ON  L4K 2P4","Tel:  905-761-9388","Fax:  905-660-7984",null,null,"sales@puritypestcontrol.com","www.puritypestcontrol.com"]
["kmtr0041",{"$f":"VLOOKUP(C42,Lookups!$E$2:$F$26,2,FALSE)","v":"t14"},"Piano Mover","Tri-R Piano Moving",null,null,null,"Tel: 416-757-0346"]
["kmtr0042",{"$f":"VLOOKUP(C43,Lookups!$E$2:$F$26,2,FALSE)","v":"t14"},"Piano Mover","CW Piano Movers",null,"(Lawrence/Pharmacy)",null,"Tel: 416-751-6260"]
["kmtr0043",{"$f":"VLOOKUP(C44,Lookups!$E$2:$F$26,2,FALSE)","v":"t15"},"Plumbing","Cande Plumbing","Beautiful Bathrooms!",null,null,"Tel:  416-445-9323"]
["kmtr0044",{"$f":"VLOOKUP(C45,Lookups!$E$2:$F$26,2,FALSE)","v":"t15"},"Plumbing","Mr. Reuter",null,null,null,"Tel:  416-494-6275"]
["kmtr0045",{"$f":"VLOOKUP(C46,Lookups!$E$2:$F$26,2,FALSE)","v":"t16"},"Pools","Paradise Pools","Byron Graham","(filling in pools)",null,"Tel: 416-222-4734"]
["kmtr0046",{"$f":"VLOOKUP(C47,Lookups!$E$2:$F$26,2,FALSE)","v":"t16"},"Pools","BRI-MEL Pool Services","Brian Smith","Pool Repair & Service",null,"Tel:  416-742-5237","Cell:  416-458-1364"]
["kmtr0047",{"$f":"VLOOKUP(C48,Lookups!$E$2:$F$26,2,FALSE)","v":"t02"},"Contractors","All Angles Renovation Ltd.","Eric Rice","17 Natal Avenue","Scarborough, ON  M1N 3V3","Tel:  416-261-9732","Fax:  416-261-8896",null,null,"allangles@sympatico.ca"]
["kmtr0048",{"$f":"VLOOKUP(C49,Lookups!$E$2:$F$26,2,FALSE)","v":"t02"},"Contractors","Handyman Matters","Repair, Remodel, Restore (Expensive says IAN)","416-486-1757"]
["kmtr0049",{"$f":"VLOOKUP(C50,Lookups!$E$2:$F$26,2,FALSE)","v":"t02"},"Contractors","Homes Design Contracting","Alfred Stanislaus","27 Deerpath Road","Toronto, ON M3A 1R4","Tel:  416-995-9458","Fax:  416-284-7501",null,null,"Alfred@la-homes.ca","www.la-homes.ca"]
["kmtr0050"]
["kmtr0051",{"$f":"VLOOKUP(C52,Lookups!$E$2:$F$26,2,FALSE)","v":"t02"},"Contractors","Larry Small (no decks)","Tel:  416-447-1236","Pager:  416-612-1493"]
["kmtr0052",{"$f":"VLOOKUP(C53,Lookups!$E$2:$F$26,2,FALSE)","v":"t02"},"Contractors","Man about the Home","Paul D. Terry","157 Marchington Circle","Scarborough, ON  M1R 3M9","Tel:  416-566-4101","cdpterry@pathcom.com"]
["kmtr0053",{"$f":"VLOOKUP(C54,Lookups!$E$2:$F$26,2,FALSE)","v":"t02"},"Contractors","Peter Dais ","Victoria Grand Estates Ltd","Tel:  416-446-7881","Fax:  416-446-7619","Email:  peterdais@rogers.com"]
["kmtr0054",{"$f":"VLOOKUP(C55,Lookups!$E$2:$F$26,2,FALSE)","v":"t17"},"Roofers","Don Mills Roofing","John Landry",null,null,"Tel:  416-444-1899","donmillsroofing@rogers.com"]
["kmtr0055",{"$f":"VLOOKUP(C56,Lookups!$E$2:$F$26,2,FALSE)","v":"t17"},"Roofers","EW Smith Roofing",null,null,null,"Tel:  416-467-7663"]
["kmtr0056",{"$f":"VLOOKUP(C57,Lookups!$E$2:$F$26,2,FALSE)","v":"t17"},"Roofers","RJ Roofing","George Eagles",null,null,"Tel:  416-691-3907"]
["kmtr0057",{"$f":"VLOOKUP(C58,Lookups!$E$2:$F$26,2,FALSE)","v":"t17"},"Roofers","Supreme Roofing","Bill Reynold ",null,null,"Tel:  416-533-9156"]
["kmtr0058",{"$f":"VLOOKUP(C59,Lookups!$E$2:$F$26,2,FALSE)","v":"t17"},"Roofers","Trudel Roofing",null,null,null,"Tel:  905-642-3515"]
["kmtr0059",{"$f":"VLOOKUP(C60,Lookups!$E$2:$F$26,2,FALSE)","v":"t18"},"Seniors","Handle with Care: Assistance to Seniors in Transition","Bob Larmour",null,null,"Tel:  905-953-7906",null,null,null,"pblarmour@sympatico.ca","www.wehandlewithcare.ca"]
["kmtr0061",{"$f":"VLOOKUP(C61,Lookups!$E$2:$F$26,2,FALSE)","v":"t19"},"Staging","Karen Sealy Designs",null,null,null,"Tel:  416-694-8588.",null,null,null,"karen@sealyconsulting.com","www.sealyconsulting.com"]
["kmtr0062",{"$f":"VLOOKUP(C62,Lookups!$E$2:$F$26,2,FALSE)","v":"t19"},"Staging","Kelly Ralph","Canadian Staging Professional and 2006 Mentor of the Year Recipient",null,null,"Tel:  416-878-9673",null,null,null,"staged4u@sympatico.ca","www.creative-touch-interiors.com"]
["kmtr0063",{"$f":"VLOOKUP(C63,Lookups!$E$2:$F$26,2,FALSE)","v":"t19"},"Staging","Prep N' Sell ","Customer Service","Toronto, Ontario ","One stop shopping for interior decorators, plastering & painting, handyman service, hardwood refinishing, carpet & floor installation, roofing repairs, mold purification systems, carpet cleaning, pet odour removal, home & appliance cleaning, wall cleaning, duct & air cleaning, decluttering.","Tel:  416-201-1010","Toll Free:  1-888-781-1123",null,null,"info@prepnsell.com","www.prepnsell.com"]
["kmtr0064",{"$f":"VLOOKUP(C64,Lookups!$E$2:$F$26,2,FALSE)","v":"t20"},"Storage","PODS",null,null,null,"Tel:  1-888-776-PODS (7637) ","Discount code #1090"]
["kmtr0065",{"$f":"VLOOKUP(C65,Lookups!$E$2:$F$26,2,FALSE)","v":"t21"},"Tilers","George Nagy",null,null,null,"Tel:  905-827-4078 (home)"]
["kmtr0066",{"$f":"VLOOKUP(C66,Lookups!$E$2:$F$26,2,FALSE)","v":"t22"},"Upholstery","Davis Upholstery",null,"390 Progress Avenue Unit 15",null,"Tel: 416-299-5190"]
["kmtr0067",{"$f":"VLOOKUP(C67,Lookups!$E$2:$F$26,2,FALSE)","v":"t22"},"Upholstery","Woodland","John Woodland","128 Manville",null,"Tel: 416-346-3538"]
["kmtr0068",{"$f":"VLOOKUP(C68,Lookups!$E$2:$F$26,2,FALSE)","v":"t23"},"Utilities","BELL CANADA",null,null,null,"Tel:  416-310-2355",null,null,null,null,"www.bell.ca"]
["kmtr0069",{"$f":"VLOOKUP(C69,Lookups!$E$2:$F$26,2,FALSE)","v":"t23"},"Utilities","ENDBRIDGE",null,null,null,"Tel:  1-877-362-7434",null,null,null,null,"www.enbridgegas.com"]
["kmtr0070",{"$f":"VLOOKUP(C70,Lookups!$E$2:$F$26,2,FALSE)","v":"t23"},"Utilities","ROGERS CABLE",null,null,null,"Tel:  1-888-764-3771",null,null,null,null,"www.rogers.com"]
["kmtr0071",{"$f":"VLOOKUP(C71,Lookups!$E$2:$F$26,2,FALSE)","v":"t23"},"Utilities","TORONTO HYDRO",null,null,null,"Tel:  416-542-8000",null,null,null,null,"www.torontohydro.com/"]
["kmtr0072",{"$f":"VLOOKUP(C72,Lookups!$E$2:$F$26,2,FALSE)","v":"t23"},"Utilities","TORONTO WATER",null,null,null,"Tel:  416-338-4829",null,null,null,null,"www.toronto.ca/utilitybill"]
["kmtr0073",{"$f":"VLOOKUP(C73,Lookups!$E$2:$F$26,2,FALSE)","v":"t24"},"Waterproofing","Kingsway Waterproofing","Richard",null,null,"Tel:  416-277-2429"]
["kmtr0074",{"$f":"VLOOKUP(C74,Lookups!$E$2:$F$26,2,FALSE)","v":"t24"},"Waterproofing","Perma Crete",null,"850 Main Street","Dartmouth, Nova Scotia  B2W 3V1","Tel:  1-800-565-LEAK",null,null,null,null,"www.permacrete.ca"]
["kmtr0075",{"$f":"VLOOKUP(C75,Lookups!$E$2:$F$26,2,FALSE)","v":"t25"},"Windows","Action",null,null,null,"Tel: 1-800-268-4248"]
["kmtr0076",{"$f":"VLOOKUP(C76,Lookups!$E$2:$F$26,2,FALSE)","v":"t25"},"Windows","Aluminum Work Astral",null,null,null,"Tel:  416-690-5542"]
["kmtr0077",{"$f":"VLOOKUP(C77,Lookups!$E$2:$F$26,2,FALSE)","v":"t25"},"Windows","Clear Again Window Restoration Ltd.","Ryan Jeans - Service Manager","237 High Park Avenue","Toronto, ON  M6P 2S5","Tel:  416-537-7778",null,null,null,"service@clearagainwindows.ca","www.clearagainwindows.ca"]
["kmtr0078",{"$f":"VLOOKUP(C78,Lookups!$E$2:$F$26,2,FALSE)","v":"t25"},"Windows","Dirt Buster Window Cleaning","Heinz Breiter","Free estimates, residential, commercial & Hi Rise cleaning, aluminum siding, eavestroughs cleaning & repair & replacement",null,"Tel:  416-789-0591","Tel:  416-997-9910"]
["kmtr0079",{"$f":"VLOOKUP(C79,Lookups!$E$2:$F$26,2,FALSE)","v":"t25"},"Windows","Home Decor Window & Decor Centre Inc.","Tom Cook","219 Connie Crescent Unit 7","Concord, ON L4K 1L4","Tel:  905-760-8350","Fax:  905-760-8345","Toll Free:1-888-995-7772","Cell:  416-768-6931","homedecor@on.aibn.com","www.homedecorwindowsanddoors.com"]
["kmtr0080",{"$f":"VLOOKUP(C80,Lookups!$E$2:$F$26,2,FALSE)","v":"t25"},"Windows","Recommended Window Cleaning","Mike Weir","209 Three Valleys Drive",null,"Tel:  416-449-5277"]
["kmtr0081",{"$f":"VLOOKUP(C81,Lookups!$E$2:$F$26,2,FALSE)","v":"t06"},"Junk Removal","Junk Boys","Darren Cook","PO Box 252","Brampton, ON L6V 2L1","Tel:  416-606-9357","Toll Free:  1-888-858-6526",null,null,"darren@thejunkboys.com","www.thejunkboys.com"]
["kmtr0082","t26","Financial Advisor","Trapeze Capital Corp.","Debbie Mendelson, CFP, FMA, FCSI","22 St. Clair Avenue East, 18th Floor","Toronto, ON M4T 2S3","Tel: 416-915-3252",null,null,"Mobile: 647-225-4690","dmendelson@trapezecapital.com\n","www.trapezecapital.com\n"]
["kmtr0083","t27","Cleaning Company","Buff N' Shine","Lisa Graves",null,null,"Tel: 416-660-2399",null,null,null,"Buffnshine98@yahoo.ca"]
["kmtr0084","t19","Staging","Cleanscaped","Elissa Wells",null,null,"Tel: 416-558-3745","Tel: 905-601-0628",null,null,"cleanscapes@yahoo.com"]
["kmtr0085","t28","Rentals","Landlord & Property Management","Sylvain Boileau","33 Shudell Avenue","Toronto, ON M4J 1C5","Tel: 416-462-3842","Fax: 416-462-1461"]
["kmtr0086","t28","Rentals","MacCulloch Properties Inc.","Marilyn Healy","103 Morse Street","Toronto, ON M4M 2P7","Tel: 416-544-1079","Fax: 416-544-1077",null,null,"info@homesuitehome.ca"]
["kmtr0087","t17","Roofers","Roofing & Renovations","Doug Densmore",null,null,"Tel: 416-694-3005"]
["kmtr0088","t29","Tree Care","Complete Tree Experts","Ernie Vilon",null,null,"Tel: 416-4749-7375"]
["kmtr0089","t29","Tree Care","Four Seasons Tree Care","Ron Wilson",null,null,"Tel: 416-495-9910"]
["kmtr0090","t29","Tree Care","Grey's Tree Service","Gary Grey",null,null,"Tel: 416-242-8159"]
["kmtr0091","t30","Fences","Protect A Child Pool Fence Company",null,null,null,"Tel: 905-814-5747",null,null,null,"protectachild-toronto@rogers.com"]
["kmtr0092","t30","Fences","CANDO Fence",null,null,null,"Tel: 416-630-3325"]
["kmtr0093","t27","Cleaning Company","Joanne","Joanne",null,null,"Tel: 416-285-5770","Cell: 647-280-6442"]
["kmtr0094","t27","Cleaning Company","Trauma Care Cleaning Services","Terry Seymour","283 Danforth Avenue #305","Toronto, ON M4K 1N2","Tel: 416-518-6922",null,null,null,"traumacare@bell.blackberry.net"]
["kmtr0095","t27","Cleaning Company","M&V Workers","Fredy Mojica","301 5 Dufresne Court","Toronto, ON","Tel: 416-429-1439","Cell: 647-234-1439",null,null,"fmojicamvz@gmail.com"]
["kmtr0096","t32","Heating & Cooling","IDEAL Heating","John Maurice",null,null,"Cell: 416-704-4126"]
["kmtr0097","t32","Heating & Cooling","Hi-Tech Heating & Cooling","Mehrdad Malek",null,null,"Cell: 416-795-8837","Fax: 416-498-8837",null,null,"hi.techheatingandcooling@gmail.com"]
["kmtr0098","t32","Heating & Cooling","All Max Heating & AC","Wajid",null,null,"Tel: 416-878-0703"]
["kmtr0099","t15","Plumbing","Plumbing","Alex",null,null,"Tel: 416-417-2322"]
["kmtr0100","t18","Seniors ","Seniors for Seniors",null,null,null,"Tel: 416-481-2733"]
["kmtr0101","t18","Seniors","Red Coats Moving Solutions",null,null,null,"Tel: 416-920-1317"]
["kmtr0102","t18","Seniors","CGC Group","Jill Kelly","66-1262 Don Mills Road","Toronto, ON M3B 2W7","Tel: 416-444-7598","Fax: 416-444-5862",null,null,"jill@cgcgroup.com","www.cgcgroup.com"]
["kmtr0103","t33","Surveyors","Surveyor","Don Roberts",null,null,"Tel: 416-755-5320","111 Railside Road, unit 304, North York ON M3A 1B2",null,null,"mail@dersurveys.ca"]
["kmtr0104","t25","Windows","Al-Don Aluminum Ltd.","Don Gordon or Allan Willis","36 Phillip Avenue","Scarborough, ON M1N 3P9","Tel: 416-284-9834","Tel: 416-266-6182","Fax: 416-266-9912"]
["kmtr0105","t25","Windows","Infinity Replacement Windows","Stan Anderson",null,null,"Tel: 905-670-5055 ext 288",null,null,null,"sanderson@marvincanada.com","www.infinitywindows.com"]
["kmtr0106","t08","Lawyers","Feld/Kalia Barristers & Solicitors",null,"72 Berkeley Street ","Toronto, ON M5A 2W7","Tel: 416-203-6347","Fax: 1-866-456-7672",null,null,"feldkalia.com"]
["kmtr0107","t23","Utilities","Power Stream Hydro (Markham, Aurora, Barrie, Bradford West Gwillimbury, Essa, New Tecumseth, Penetanguishene, Richmond Hill, Vaughan & Surrounding Areas)",null,null,null,"Tel: 1-877-963-6900 (visit website to verify your town/city contact number)",null,null,null,"info@powerstream.ca ","www.powerstream.ca"]
["kmtr0108","t05","Home Inspectors","Lighthouse Inspections Toronto East","Glen Cowan",null,null,"Tel: 416 653 9009","Toll Free 1-877 653 9009",null,null,"glen@lighthouseinspections.com","www.Lighthouseinspections.com"]
["kmtr0109","t10","Movers","Firemen Movers",null,null,null,"Tel: 416-225-5733"]
["kmtr0110","t34","Paving","OSC Onsite Paving Contracting Inc.","Max Fani","#16-467 Edgely Blvd. Suite 202","Vaughn, ON L4K 4E9","Cell: 416-505-8853","Tel: 905-761-9771","Fax: 647-340-5491"]
["kmtr0111","t34","Paving","401 Paving Ltd.","Sam Bahadori",null,null,"Tel: 416-441-0401",null,"Fax: 905-640-8741",null,"info@401paving.com"]
["kmtr0112","t08","Lawyers","Basman Smith LLP (Family Lawyer)","Jennifer Samara Shuber C.s., LL.B., M.S.W.","1 Dundas Street West Suite 2400, Box 37","Toronto, ON M5G 1Z3","Tel: 416-860-1950","Fax:416-860-1951",null,null,"jshuber@basmansmith.com","www.basmansmith.com"]
["kmtr0114","t36","Dentist","Family Dentist","Dr. Peter Markle","4040 Finch Avenue East ","Scarborough, ON M1S 4V5 ","Tel: 416-291-1494"]
["kmtr0115","t36","Dentist","Orthodontist","Dr. James Noble","1448 Lawrence Ave E","Toronto, ON M4A 2V6","Tel: 416-447-1515"]
["kmtr0116","t36","Dentist","Family Dentist","Dr. Barry Lever","1090 Don Mills Road, Suite 604 (Royal Bank Tower)","Toronto, ON M3C 3R6","Tel: 416-446-0500"]
["kmtr0117","t35","Doctor","Optometrist","Dr. Nish Rajani","6 Maginn Mews, Suite 201 (Shops at Don Mills)","Toronto, ON M3C 0G9\n","Tel: 416-447-4611"]
["kmtr0118","t35","Doctor","Gynecologist (OBGYN)","Dr. Adrian Brown","North York General Hospital","Toronto, ON","Tel: 416-756-6680","Fax: 416-756-6355"]
["kmtr0119","t35","Doctor","Gynecologist (OBGYN)","Dr. Mathew Sermer","Mt. Sinai, 700 University Avenue, #3269","Toronto, ON","Tel: 416-586-4800 ext 3195","Fax: 416-586-5223"]
["kmtr0120","t37","Veterinarian","McGilvray Veterinary Hospital","Dr.Stuart Brown","1525 Avenue Road (at Lawrence)","Toronto, ON M5M 3X3","Tel: 416-783-6131","Fax: 416-781-0486 ",null,null,null,"http://mcgilvrayvet.com/index.php"]
["kmtr0121","t38","Funeral Home","The Simple Alternatives",null,"275 Lesmill Road","North York, ON M3B 2V1","Tel: 416-441-1580","Fax: 416-441-1030 ",null,null,"rloren@mountpleasantgroup.com ","http://www.legacy.com/obituaries/thestar/obituary-funeralhome.aspx?fh=the-simple-alternatives-funeral-centres&fhid=3173"]
["kmtr0122","t39","Locksmith","A-OK Locksmith",null,null,null,"Tel: 416-467-0000"]
["kmtr0123","t39","Locksmith","Citywide Locksmith",null,"1750 Avenue Road","Toronto, ON","Tel: 416-789-1213"]
["kmtr0124","t39","Locksmith","ACME",null,"2077 Lawrence Avenue East",null,"Tel: 416-699-9999"]
["kmtr0125","t27","Cleaning Company","GP'S Carpet & Upholstery Care","George Nanos",null,null,"Tel: 647-834-0173"]
["kmtr0126","t25","Windows","Blue Sky Professional Services (Commercial & Residential Window Cleaning)","Peter Terriss","47 Wallingford Road","Toronto, ON M3A 2V2","Tel: 416-723-9067","Fax: 416-444-8506"]
["kmtr0127","t39","Locksmith","Simply Doorlocks","Shafique Motani","9 Grass Meadoway","North York, ON M2H 2V4","Tel: 416-494-7420","Fax: 416-494-8168","24 Hour Pager: 416-582-9503"]
["kmtr0128","t02","Contractors","Rob's Renovations & Handyman Services","Robert Maltais","28 Industrial Street #107","Toronto, ON M4G 1Y9","Tel: 416-697-5210"]
["kmtr0129",{"$f":"VLOOKUP(C128,Lookups!$E$2:$F$26,2,FALSE)","v":"t10"},"Movers","Two Men and a Truck","Farhad Sadoon","2700 Dufferin Street #42","Toronto, ON M6B 4J3","Cell: 416-728-8891","Tel: 416-854-7116","Fax: 416-213-8268",null,"farhad.sadoon@twomen.ca","www.twomendandatruck.ca"]
["kmtr0130","t40","Electrician",null,"Jon Holt",null,null,"Tel: 416-694-6673","Cell: 416-553-8287"]
["kmtr0132","t40","Electrician","JTL & Sons",null,null,null,"Tel: 905-294-7500"]
["kmtr0133","t41","Limousine Service","United Limousine",null,null,null,"Tel: 416-732-9202",null,null,null,null,"www.unitedlimousine.com"]
["kmtr0134","t42","Drapery","Drapery Source Crazy Joe's","Ted/Leo","1420 Kennedy Road","Scarborough, ON M1P 2L7","Tel: 416-752-7531","Cell: 416-882-2117",null,null,"tedsdrapery2010@yahoo.com","www.draperysourcecrazyjoe.com"]
["kmtr0135","t27","Cleaning Company","BNK Cleaners",null,null,null,"Tel: 647-282-2920",null,null,null,"nadirajohn@gmail.com","www.bnkmaintenance.com"]
["kmtr0136","t43","Personal Trainer","Laylor Gym","Charles Thompson",null,null,null,null,null,null,"chastom@me.com","www.laylor.com"]
["kmtr0137","t44","Designer/Architect","Goulding Design Inc.","Jon Goulding",null,null,"Tel: 416-571-1735",null,null,null,"jon@gouldingdesign.com","www.gouldingdesign.com"]
["kmtr0138","t45","Organizing","Neat4Ever","Uli Philps - Professional Organizer",null,null,"Tel: 647-830-0753",null,null,null,"uli@neat4ever.ca","www.neat4ever.ca"]
["kmtr0139","t46","Computers & IT","Larry Philps Technology","Larry Philps - President & Principal Consultant",null,null,"Tel: 416-543-1030",null,null,null,"larry@philps.ca"]
["kmtr0140","t44","Designer/Architect","Modus Architects","Mona Elali","100 Sunrise Avenue, #203","Toronto, On","Tel: 416-630-0288",null,null,null,"mona@modusarchitects.ca","www.modusarchitects.ca"]
["kmtr0141","t44","Designer/Architect","Room Revival","Erin Eno",null,null,"Tel: 905-427-9209",null,null,null,"info@roomrevival.ca","www.roomrevival.ca"]
["kmtr0142","t31","Contents","The Great Estate Sale",null,null,null,"Tel: 416-431-6663",null,null,null,"www.thegreatestatesale.com"]
["kmtr0143",{"$f":"VLOOKUP(C141,Lookups!$E$2:$F$26,2,FALSE)","v":"t19"},"Staging","Room Revival","Erin Eno",null,null,"Tel: 905-427-9209",null,null,null,"info@roomrevival.ca","www.roomrevival.ca"]
["kmtr0144","t31","Contents","Transition Squad",null,null,null,"Tel: 416-249-4049",null,null,null,"info@TransitionSquad.com","www.transitionsquad.com"]
["kmtr0145","t31","Contents","The Next Move",null,null,null,"Tel: 416-234-2789",null,null,null,"michael@thenextmove.ca","www.thenextmove.ca"]
["kmtr0146","t47","Specialty Shops","Ko's Gifts Shops at Don Mills","Gary Ko","4 Marie Labatte Road","Toronto, ON M3C 3M9","Tel: 416-447-3621",null,null,null,null,"gift-boutiques.ca"]
["kmtr0147","t47","Specialty Shops","Ko's Gifts Markville Shopping Centre","Lindsay Ko","5000 Highway 7 at McCowan","Markham, ON L3R 4M9","Tel: 905-477-6100",null,null,null,null,"gift-boutiques.ca"]
["kmtr0148","t26","Financial Advisor","IPC Investment Corp","Lyn Greer, CA, CFP",null,null,"Tel: 905-881-9060","Fax: 905-881-5130",null,null,"www.lyngreer.ca"]
["kmtr0149","t48","Disaster Recovery","TriStar Disaster Recovery Inc.",null,null,"Toronto","Tel: 416-619-0847","Fax: (289) 389-8901",null,null,"mail@tristardr.ca","tristardisasterrecovery.com"]
["kmtr0150","t22","Upholstery","Dry Upholstery Care",null,null,null,"Tel: 905-792-7068"]
["kmtr0151","t50","Feng Shui","Feng Shui - The Art of Living","Ms. Samia Ali - Consultant/Practioner/Teacher",null,null,"Tel: 647-982-8881",null,null,null,"canada.fengshui@gmail.com, samia.ali.fengshui@gmail.com"]
["kmtr0152","t51","Chinese Medicine","The Best Chinese Medicine - Acupuncture, Herbal Medicine & TaiJi Quan","Dr. Susan Hu","379 Danforth Ave, 2nd Floor",null,"Tel: 416-466-2988",null,null,null,null,"www.bestofchinesemedicine.com"]
["kmtr0153","t26","Financial Advisor","Matheis Financial Group - Life Insurance & Alternative Mortgage Solutions","Michael Krem","1101 Kingston Road, Suite 150","Pickering, On L1V 1B5","Tel: 905-837-2600","Fax: 905-937-2598",null,null,"michael@matheisteam.com","www.matheisteam.com"]
["kmtr0154","t01","Banks/Mortgages","Matheis Financial Group - Life Insurance & Alternative Mortgage Solutions","Michael Krem","1101 Kingston Road, Suite 150","Pickering, On L1V 1B5","Tel: 905-837-2600","Fax: 905-937-2598",null,null,"michael@matheisteam.com","www.matheisteam.com"]
["kmtr0155","t52","Vermiculite","EMSL Analytical Inc",null,"10 Falconer Drive","Mississauga, On L5N3L8","Tel: 289-997-4602"]
["kmtr0156","t19","Staging","Regroup Property Stylists","Patricia",null,null,"Tel: 416-277-3282",null,null,null,"patricia@regroupps.com","www.regroupps.com"]
["kmtr0157","t02","Contractors","Expanders Construction","Paul & Dante Rezaie",null,null,"Tel: 416-800-8794","Toll Free: 1-877-240-2233"]
["kmtr0158","t08","Lawyers","Stephen H. Shub Prefessional Corporation","Stephen Shub","5799 Yonge Street, #803 + 7 other locations",null,"Tel: 416-222-1882",null,null,null,"quote@homelegalcost.com","www.homelegalcost.com"]
["kmtr0160","t15","Plumbing","Chuck Lui",null,null,null,"Tel: 416-576-8112"]
["kmtr0161","t40","Electrician","Chuck Lui",null,null,null,"Tel: 416-576-8112"]
["kmtr0162","t49","Pet Care","PAWSalot - Dog Walker/Pet Sitter/House Sitter","Kim",null,null,"Tel: 416-391-0147",null,null,null,"kim@pawsalot.ca","www.PAWSalot.ca"]
["kmtr0163","t10","Moving","Downsizing Diva! Specializing in Downsizing and Moving Seniors","Karen Shinn",null,null,"Tel: 416-757-0319",null,null,null,"karen@downsizingdiva.com","www.downsizingdiva.com"]
["kmtr0164","t10","Moving","Moving Seniors with a Smile","Laurie Bell","4 Parker Avenue, Toronto, Ontario M1N 2B6",null,"Tel: 416-697-8106",null,null,null,"laurie@movingseniorswithasmile.ca","www.movingseniorswithasmile.ca"]
["kmtr0165","t18","Seniors","Moving Seniors with a Smile","Laurie Bell","4 Parker Avenue, Toronto, Ontario M1N 2B6",null,"Tel: 416-697-8106",null,null,null,"laurie@movingseniorswithasmile.ca","www.movingseniorswithasmile.ca"]
["kmtr0166","t53","Fridge or Freezer Removal","Toronto Hydro",null,null,null,"Tel: 1-877-797-9473"]
["kmtr0167","t54","Scrap Collector","City Scrap - Green World"," Mustafa Ozkilic"," 55 Wynford Heights Crescent, #905"," Toronto, On M3C 1L4","Tel: 647-458-1952 (cell)","Tel: 647-349-7441 (home)",null,null,"mustafaoz@live.ca"]
["kmtr0168","t55","Kitchens & Fine Cabinetry","Wolstencroft - Kitchen & Fine Cabinetry"," David Wolstencroft","25 Scarsdale Road, #2","Toronto, ON M3B 2R2","Tel: 416-385-0043 or 1-866-309-1548","600 Euclid Street #5","Whitby ON L1N 5C2","Tel: 905-427-9991","david@kitchenreno.ca","kitchenreno.ca"]
["kmtr0169","t32","Heating & Cooling","EASTGAS ENERGY","Frank Occhipinti","660 Eglinton Ave. E #120","Toronto, ON M4G 2K2","Tel: 416-716-8475 or 289-217-1945",null,null,null,"frank.occhipinti@yahoo.ca"]
["kmtr0170","t20","Storage","SelfStor",null,"150 Bermondsey Rd","North York, ON M4A1Y1","Tel: 416-751-7867",null,null,null,null,"http://www.selfstor.ca/"]
["kmtr0171","t20","Storage","StorageMart",null,"875 Don Mills Road","Toronto, Ontario M3C1V9","Tel: 416-607-6070"]
["kmtr0172","t20","Storage","Canadian Self Storage",null,"835 York Mills Road","Don Mills, Ontario M3B1Y2","Tel: 416-449-2853",null,null,null,"yorkmills@canadianselfstorage.com"]
["kmtr0173","t20","Storage","Carnforth Storage",null,"62 Carnforth Road","Toronto, ON M4A2K7","Tel: 416-755-5800",null,null,null,"info@carnforthselfstorage.ca","http://www.carnforthselfstorage.ca/"]
["kmtr0174","t06","Junk Removal","Bin There Dump That",null,"718 Centre St. N","Whitby, ON L1N 9A9","Tel: 1-866-688-3510"]
["kmtr0175","t29","Tree Care","FSM Landscaping Inc."," Luis Romeiro"," 1895 Clements Road, Unit 180"," Pickering, On L1W3V5","Tel: 905-686-1200","Fax: 905-686-1205",null,null,null,"www.fsmlandscaping.ca"]
["kmtr0176","t03","Floors","DARMAGA Hardwood Flooring","Wally Darmaga","70 Newkirk Road., Unit 1","Richmondhill, Ontario L4C3G3","Tel: 416-213-7134 or 1-800-387-5790","Tel: 905-770-1900"]
["kmtr0177","t03","Floors","Gino Hardwood Flooring","Jake",null,null,"Tel: 416-533-5322"]
["kmtr0178","t03","Floors","Royale Oak Hardwood Flooring",null,null,null,"Tel: 416-449-4251"]
["kmtr0179","t10","Moving","Top Team Movers - East York, North York & The Beaches",null,null,null,"Tel: 416-826-1596"]
["kmtr0180","t10","Moving","You Move Me","Mike Lutley - Manager of Sales","100-9 Dibble St.","Toronto, On M4M 2E7","Tel: 647-887-0611","Tel: 416-572-0202","1-800-926-3900",null,"mike.lutley@youmoveme.com","www.youmoveme.com"]
["kmtr0181","t01","Banks/Mortgages","Mortgage Edge","Jake Abramowicz","210-15 Wertheim Court","Richmondhill, Ontario L4B 3H7","Tel: 905-707-6702","Tel: 416-910-4448","Fax: 888-819-4816",null,"mortgagejake@gmail.com","www.mortgagejake.com"]
["kmtr0182","t02","Contractors","Cosburn Properties LTD","Rob Hughes",null,null,"Tel: 416-788-0902",null,null,null,"rhughes000@sympatico.ca"]
["kmtr0183","t19","Staging","Susan Jones",null,null,null,"Tel: 416-484-8220",null,null,null,"susan_jones@rogers.com"]
["kmtr0184","t12","Painters","Student Works Painting"," Vanessa Barbini - Owner/Operator",null,null,"Tel: (416)857-4100",null,null,null,"vbarbini@uoguelph.ca"]
["kmtr0185","t08","Lawyers","Devry Smith Frank Lawyers & Mediators","Timothy Deet","95 Barber Greene Road #100","Toronto, Ont M3B 2T3","Tel: 416-449-1400 or 905-305-9994","Toll Free: 1-866-474-1700","Fax: 416-449-7071",null,"  info@devrylaw.ca"]
["kmtr0186","t10","Movers","RoadRunners Moving & Storage",null,null,null,"Tel: 416-900-6027","Toll Free At 1-800-901-0715",null,null,null,"www.roadrunnersmoving.ca"]
["kmtr0187","t27","Cleaning Company","Julia's Angels Professional Cleaning Services","Julia Vrtik","159 Brooklawn Avenue","Scarborough, ON M1M 2P8","Tel: 265-5420",null,null,null,"JuliaVrtik@gmail.com"]
["kmtr0188","t02","Contractors","Nussis General Services"," Laz Nussis","Don Mills - Especially Don Mills Condo's",null,"Tel: 416-994-2182","Fax: 416-994-7334",null,null,"lazman@rogers.com"]
["kmtr0189","t02","Contractors","Brian Vieira",null,null,null,"Tel: 416-857-7170"]

{"sheet":"Testimonials","index":4,"n_rows":153,"n_cols":6,"rows_kept":153,"cut":false,"hidden":false,"merged":[]}
["Karen Millar Testimonials"]
[]
["testimonial_id","status","name","date","quote"]
["kmts0001","OFF","Laura & John","November, 2005","\"Fantastic service, great team, terrific agent. Went above and beyond the call every time. We appreciate everything you have done for us to find our dream home and to sell our previous residence\""]
["kmts0002","OFF","Bob Ewing","April, 2005","\"Hi Karen, Thank you and you team for all the work you did selling my mother's house. With my mother moving into a nursing home the prospect of selling the family home of more than 40 years was un-nerving to say the least. Your team made this much easier than I ever imagined. I can't thank Ian enough for all the work he put into the house and hauling off stuff to the dump, (more than once). This was definitely above and beyond what we expected. You, and your team were always only a phone call away when we needed reassurance.\n\nThe word “Team” is used quite freely in today's business world without giving much thought to what it truly means. Companies spend ridiculous amounts of money to send their employees on “Team Building” retreats. The Karen Millar Team actually understands and lives the “Team” philosophy. I quite often use your group as an example of teamwork within the workplace, in my own office. I only wish other companies took the same approach to Customer Service.\n\nAgain, Karen, I truly want to thank you for everything you did for us. I can't tell you how much it was appreciated.\""]
["kmts0003","OFF","Carla & Oswald","May, 2005","\"With Karen, it's all about SERVICE!!! All team members are prompt, efficient, professional and friendly. All the little extras make a big difference!\nIt was a pleasure dealing with ALL of you.\""]
["kmts0004","OFF","Lola","May, 2005","\"I was looked after like family. The Millar Team went far beyond expectations. Thank you for all of your help.\""]
["kmts0005","OFF","Rakesh & Neha","May, 2005","\"Our experience with your team was outstanding! The whole process was pleasant and we felt like you cared about our needs and concerns. Our most interaction was with John and Ian- two excellent individuals that delivered beyond our expectations! We have already recommended your team to everyone we know that is in the market to buy and sell.\""]
["kmts0006","OFF","Dale & Donald","May, 2005","\"We have already been singing your praises to everyone we talk to. You made the whole experience from beginning to end a real pleasure. Thank you so much!\""]
["kmts0007","OFF","Taline Gumushdjian ","May, 2005","\"Dear Karen, I cannot tell you how much of an enjoyable experience it has been dealing with you and every member of you “team”…Ian and Jeff. Everyone on board is genuinely interested in making an emotional move as pleasant and memorable as possible. Please accept our family's appreciation for your honest and sincere care in marketing and selling our home.\""]
["kmts0008","OFF","Louise & Mike","October, 2006","\"Karen and her team made the whole experience as stress free as possible. We would definitely recommend Karen!\""]
["kmts0009","OFF","Sheila","March, 2006","\"Karen, you always put our minds at ease! Every member of your team is kind and thoughtful and on top of all that, you love my dog! What else can we I ask for?\""]
["kmts0010","OFF","Hanna & Heder","January, 2007","\"Katrina and Ian were extremely helpful. You have an exceptionally efficient team that works well together - very professional!\""]
["kmts0011","OFF","Luis & Gina","January, 2007","\"Having been through the buying/selling process a number of times, this was by far the most positive and quickest we have ever experienced and we could not have been happier with the outcome\""]
["kmts0012","OFF","Melanie & David","February, 2007","\"After over six months of open houses on weekends, week-night viewings, obsessed MLS searches David and I are proud property owners!!!!!!!!!!! The multi-offer feeding frenzy that \"IS\" the GTA didn't kill us after all!!!!!!!!!!! A\"big up\" to our fab agent….the one, the only: Jeff Vedan who has been soooo incredibly patient. Jeff - you are a true agent and a good friend.\""]
["kmts0013","OFF","David, Gordon, Michele and Larry ","March, 2007","\"On behalf of all of us, I wish to extend a heartfelt thank you for all of your work on the sale of the Nimmo house on Lacewood. You guys are amazing and the last minute work that your team did yesterday was truly impressive and greatly appreciated. Thanks ever so much!\""]
["kmts0014","OFF","Elza","June, 2007","\"Thank you to the Team for making the sale of my home run smoothly. I hope to do business with you again - you are great!\""]
["kmts0015","OFF","Adriano & Patricia","July, 2007","\"Your services exceeded our expectations. Thank you for everything. John was knowledgeable, efficient and effective\""]
["kmts0016","OFF","Bryan & Michelle","September, 2007","\"Dear John & Team, We want to sincerely thank you and your team for the superb customer service and genuine consideration during the sale of our home. Thanks again for the time and the commitment!\""]
["kmts0017","OFF","Kim","November, 2007","\"Dear Karen, We just wanted to thank you again for your incredible care\nin selling the house. To be able to walk away with almost $100,000 more\nthan originally anticipated is such a huge relief for the many years to come.\nThank you also for your advice, your help with the landscaping, your\nteams assistance with preparing the home for sale, your help in\nconnecting us with Rosemary, the great feature sheet, and your\nenthusiasm and kindness throughout. It really meant a lot to us and we\ncan say, without a doubt, that you definitely exceeded our expectations.\""]
["kmts0018","OFF","Aida & Saida","November, 2007","\"Whatever you think may be above and beyond is usual for this team.\""]
["kmts0019","ON","Dan & Lina","January, 2008","\"Once again it was great working with the Karen Millar Team. Their professionalism is unparalleled and their service second to none. Karen, Jeff, Ian, Katrina and Dana made the process of finding our dream home a truly memorable and enjoyable experience. Thanks again.\""]
["kmts0020","OFF","Jen",2008,"\"Really you guys are awesome. I cannot give you enough good PR (all of which you deserve) and will be sure to refer you to anyone and everyone I know who needs agents, near or far.\""]
["kmts0021","ON","Linda & Michael","February, 2008","\"We are settling in to our new home and are very happy with it. We wanted to write to thank you for all that the Millar Team did for us. You really went above and beyond our expectations of a group of real estate professionals. The whole process was less than two months from the time we called John to start looking at houses to the time we moved into our new house. In between we renovated and sold our house with a lot of help from you. We were able to beat the new city of Toronto land transfer tax and the savings was significant.\n<BR><BR>\nJohn had great insight into our neighbourhood. This allowed us to narrow down our search to houses that were suitable for our family. In less than two weeks we had purchased our new home. John was always available and always pleasant to deal with. Buying a house can be a very stressful time but John's experience and great sense of humour made it an enjoyable experience.\n<BR><BR>\nWhile we looked for a new house, we also were preparing our old house to sell. Karen's advice was instrumental in our choices for renovating our old house. She knew exactly which improvement would provide us with a return on the sale of the house. The Millar team also had great contacts with contractors that helped us get our house ready for sale.\n<BR><BR>\nThe selling of our house was very fast. This was important since we wanted to minimize the disruption to our family.\n<BR><BR>\nKatrina created a professional information sheet and listing for potential buyers. The photos by Dana and floor plan by Ian were a nice touch. Ian also made some last minute repairs so that the house would show well.\n<BR><BR>\nKaren's marketing strategy was right on target. The asking price was set to generate interest in our property and it certainly did! Karen and Jeff hosted open houses on Saturday and Sunday afternoon. Real estate agents showed our house for six days from Saturday to Thursday.\n<BR><BR>\nOffers were taken on Thursday night. This was also very fast and painless. We had heard horror stories from friends of offers going back and forth until after midnight. This was not the case with the Millar team. We had six offers and within one hour our house was sold. We received more than the asking price and were extremely pleased with the price we got for our home.\n<BR><BR>\nWe will recommend the Millar team to our friends. We would like their experience to be as pleasant as ours.\n<BR><BR>\nThank you all very much.\""]
["kmts0022","ON","Leon & Robyn","January, 2008","\"Robyn and I thank you and your team for the outstanding role you played in accomplishing the sale of our home. It was a pleasurable experience for us to have agents who are not only professional and competent, but also empathetic and helpful. Needless to say, we are also happy with the price achieved. We will be recommending you and your team to all our friends.\""]
["kmts0023","ON","Lucy","February, 2008","\"My family and I wish to thank you and your family for your many considerations and kindness when selling my home. As it was my first time it was quite an experience for me. Thank you again.\""]
["kmts0024","OFF",null,"March, 2008","\"Jeff Vedan was an excellent agent. He was attentive to our needs, patient, prompt in responding to our requests, punctual for all appointments, & very pleasant to deal with throughout. We would highly recommend him.\""]
["kmts0025","ON","Mavis","March, 2008","\"I was more than well pleased by the professional and confident manner The Millar Team listed, advertised and quickly sold my home. I can’t thank you enough!  Everything was beyond my expectations!!\""]
["kmts0026","ON","Rob & Erin","April, 2008","\"Very personable, efficient service! We felt very comfortable discussing our needs with both Jeff and Karen. Thank you very much.\""]
["kmts0027","ON","Michael & Amanda","June, 2008","\"Jeff was very knowledgeable, hard working and made the process very enjoyable. We got the impression that he cared as much about the purchase as we did and that made us very comfortable.\""]
["kmts0028","ON","Nigel & Catherine","September, 2008","\"Thank you Karen, Ian, John and team. You guys were great (as usual). We appreciated all your dedication and hard work.\""]
["kmts0029","ON","Ralph & Janet","September, 2008","\"Thank you for your professional approach and excellent service\""]
["kmts0030","ON","Brian & Michelle","November, 2008","\"Jeff did a great job always helping out and answering any questions we didn’t know.\""]
["kmts0031","ON","Joyce & Herb","January, 2009","\"Good support services – moving & lighting, photographs & brochures were well done.  You and the team gave us excellent service at all times. We wish you well in the future\""]
["kmts0032","ON","Ed & Freda","March, 2009","\"We would like to thank you & your team for the professional manner in which you handled the sale of our house.  We appreciate the prompt service in getting everything organized on such short notice.  Something I personally dreaded turned out to be a very positive experience especially when the house sold in one month.  The mover you recommended did a fabulous job. So I am keeping your card in the event we move again & we would certainly recommend you any of our friends. Thank you all & have a happy prosperous 2009\""]
["kmts0033","ON","Rob & Simon","April, 2009","\"Dear Karen, Ian, Katrina, Jeff and Dana,\nFirst off - THANKS . All you hard work has been so appreciated, Last night we slept without waking up for a full 8 hours, the first time in about 5 months! You truly are a great team and also caring people, which you don't find often in this world.\"\n"]
["kmts0034","ON","Stephen & Carolyn","April, 2009","\"We interviewed several real estate agents before deciding and no one came close to Karen Millar. Besides her professionalism, her expertise really stood out. She really understood the real estate market and stressed the importance of marketing. We quickly found out that the team behind her is just as professional and unbelievably helpful. From cosmetic repairs, the beautifully photographed/designed feature sheet, the progress updates and the on target marketing...the team went above and beyond. We couldn't have been in better hands. Our house sold in 5 days and for more than asking. We couldn't be happier! We would, absolutely, recommend the Karen Millar team to anyone!\""]
["kmts0035","ON","Laszlo","May, 2009","\"Thank you Karen for everything! You were spot on!\""]
["kmts0036","ON","Godrej & Katie","July, 2009","\"Jamie was a pleasure to work with and it was amazing having a group of people working with us as a team rather than one individual!\""]
["kmts0037","ON","Ross","July, 2009","\"The quality of service was excellent (second to nobody)\""]
["kmts0038","ON","Kim","September, 2009","\"Jeff was beyond excellent! Thank you very much for making us feel so welcome to the team, the new neighbourhood and in our new home!\""]
["kmts0039","ON","Desiree","October, 2009","\"Your Team made selling our home a very positive experience\""]
["kmts0040","ON","Beth","November, 2009","\"Thanks for all your help. My move was easier than I thought it would be!\""]
["kmts0041","ON","Thomas & Jennifer","November, 2009","\"Karen - it was a pleasure working with you and the team. You exceeded all of our expectations!!\""]
["kmts0042","ON","Gordon","November, 2009","\"Karen, I think you did a really splendid job for me. You and your team made it easier for me to deal with a severe change after a half a century in one place. I am grateful to you all but especially you and John and Ian.\""]
["kmts0043","ON","Justin & Makiko","November, 2009","\"It was a pleasure working with Jeff Vedan. He really helped us when our other agent let us down.\""]
["kmts0044","ON","Joan & Tom","December, 2009","\"Congratulations, Karen , on your platinum level real estate award. It is well deserved for you and your  team. You and your family certainly gave us your all in selling our home. Tom and I wish to thank you for your courtesy, thoroughness and expertise. You understood the emotions involved in selling our home and made the process as calm and quietly business-like as possible.  Your negotiating skills are impeccable. It is a pleasure to recommend you and your team to friends. Thank you again!"]
["kmts0045","ON","Josh & Jenny","February, 2010","\"We were so pleased with Jeff's level of service in assisting us with the purchase of our first home.  Jeff went above and beyond our expectations as an agent to ensure that we were represented and supported as buyers throughout the entire purchasing process.  As discerning first time buyers Jeff was able to bring his exceptional knowledge of homes in the area, as well as offer first time home buyer tips from a real estate and home construction point of view. This was invaluable to us in order to feel confident in our purchase and we will certainly be referring him on to our friends and family\"."]
["kmts0046","ON","Chris & Judith","February, 2010","\"The level of service and the attention to detail far exceeded our expectations. Add to that the endearing personalities of Karen, John and the rest of the team and we could not have been happier. Many thanks to the Karen Millar Team!\""]
["kmts0047","ON","Sorin & Isabelle","April, 2010","\"Dear Jamie, We would like to express our gratitude for your help and support in buying our first house. You proved to have a lot of patience during our extensive search and provided us with all the necessary information needed for such an important purchase. We appreciate your guidance and support in researching multiple neighborhood areas and mainly giving us the tools to pursue listing opportunities based on price and future developments. It was a pleasure working with you and we will most definitely recommend your services for your professionalism, knowledge of the real estate market and being a trustful partner in our buying process.\"\n\n"]
["kmts0048","ON","James, Sandra and Jacob","April, 2010","Dear Jeff, Karen and the rest of the Millar Team, Thanks so much for helping us find and buy our first home.  We are truly ecstatic to move into this great house and turn it into our home. We really appreciate your hard-work, patience, kindness and expert advise and are particularly thankful for your honesty and integrity in this ruthless market.  We look forward to being in touch and thanks again a million times."]
["kmts0049","ON","Ray and Family","April, 2010","\"Karen, you and your team did a terrific job for us. I will not hesitate to recommend you to my friends. Thanks again.\""]
["kmts0050","ON","Angie & Lee","May, 2010","\"Our house and condo will be closing next week, and we couldn't let another day go by without writing to you.\nYou and your team provided some of the best service we have ever encountered.  It is rare for a consumer to be treated so well by an organization.  Your team surpassed any and all expectations we had.  Moreover, we always felt like we were your only client (we are on your website daily - we KNOW you have many other clients and higher priced ones at that). Specifically, Karen, I have never met an agent who knows the market like you.  Katrina is kind and profoundly efficient.  Dana was a pleasure to have in our home for photos and her work was breathtaking.  Jamie's warmth and humour made us feel like family.  And Ian - Ian is universally competent - and we loved seeing our little boy light up whenever Ian walked in the room.  Finally, John.  It is difficult to put into words just what John means to us.  We had no idea about houses, markets or neighbourhoods until we met John.  He held our hand throughout the process, was patient and funny and taught us so much.  We are thrilled with our new home, but will miss seeing you, John and the team regularly.  We will shout your name from the rooftops. From the bottom of our hearts, thank you\".","\n"]
["kmts0051","ON","Andreas & Magdalena","May, 2010","\"We consider you guys as family. Every time we spend together we have nothing bad to comment about. The Millar Team is a very well run business and we always come out feeling very confident and happy about the decisions we've made. We would recommend the Millar Team to anyone we know. Thanks again for everything!\""]
["kmts0052","ON","Carri","May, 2010","\"It's always a pleasure to work with your team!\""]
["kmts0053","ON","Eric & Gerry","June, 2010","\"Jeff Vedan was very professional. Every time we met to see a condo he was dressed in a suit & tie. I've already recommended Jeff Vedan to my friend. I would recommend anyone on the Karen Millar Team.\""]
["kmts0054","ON","Dean & Lana","June, 2010","\"Lovely family - a pleasure!\""]
["kmts0055","ON","Hiromi","July, 2010","\"Another happy customer is here. You did excellent job in selling and buying our house. You also helped us in preparing for showing. Thank you so much. We'll definitely recommend you and your team to our friends.\""]
["kmts0056","ON","John & Michelle","July, 2010","\"We will continue to use you and recommend you to anyone!\""]
["kmts0057","ON","Patrick & Pearl","August, 2010","\"Dear Karen, Ian, Katrina, John, Jamie and Team, Thank you very much for helping us sell our house. We were so lucky to have your team working for us.\""]
["kmts0058","ON","Hadi & Mina","September, 2010","\"You made a stressful experience enjoyable! We appreciate all the hard work and will always come to you and recommend you. Thank you!\""]
["kmts0059","ON","Nat & Andrew","September, 2010","\"Fabulous! We love our home!! Thank you a million times over for all of your help! We have never felt so comfortable with such a big decision!\""]
["kmts0060","ON","Helen","November, 2010","\"The Karen Millar group are fantastic. I can't say enough about them. They were excellent and went above and beyond to help and assist me in selling my house. They are truly, truly a wonderful group. Thank you for all of your help. You are great people.\""]
["kmts0061","ON","Andrew & Betty","January, 2011","\"Karen, I feel guilty for not getting a message to you sooner, but not having moved in the last 50 years we found an awful lot of things to do. We still have many boxes to unpack, and many things to re-arrange. It has been quite an experience. You and your team could not have done a better job for us. Without your help I don’t know how we would have managed. We have decided to stay here for at least the next 50 years, but should we change our minds and decide to move, you can be sure we will call you.\""]
["kmts0062","ON","Jason ","January, 2011","\"I would like to thank you and your team so much for your dedication and hard work on the sale of my home! This one is one to remember and I've definitely learned a lot off of this sale! I'm just so happy everything worked out! It was a pleasure working with you and will continue to do business in the future. Ill call you when I'm ready to purchase a new house! Thank you again\""]
["kmts0063","ON","Rob & Nell","January, 2011","\"To you and your team- Great to work with you!\""]
["kmts0064","ON","Maureen","January, 2011","\"In a word Karen is amazing! She is detailed, knowledgeable and eager to help. She will ensure you have the best possible return on your investment. Karen is a staple in our community. Always present, giving back and paying it forward. Approachable, enthusiastic and creative in all her endeavors both professionally and personally. It is without hesitation I would recommend Karen and the Karen Millar Team!\" \n"]
["kmts0065","ON","Tom","January, 2011","\"Karen possess a character trait that has become so rare in today's society. She listen's before she speaks and she never stop's putting her client's best interest at heart. A true professional!\""]
["kmts0066","ON","Allison","February, 2011","\"I Love working with the Karen Millar Team!\""]
["kmts0067","ON","Harry & Michelle","March, 2011","\"You’re an awesome agent!  The best we’ve ever had.  And believe me, we’ve had many, both good and bad.  Michelle and I are happy to have you on our team!\nThanks for all your hard work Karen (and Ian)!\"\n \n\n"]
["kmts0068","ON","Brad & Tyler","March, 2011","\"Jeff: excellent service, really appreciated your support + knowledge! Thanks for helping us take a big step in our adventure of life!\""]
["kmts0069","ON","Jim & Jan","March, 2011","\"Special mention to Jeff Vedan. He was fantastic. Always polite and helpful. He constantly stayed in touch with us to keep us informed. Well done Jeff!\" "]
["kmts0070","ON","Elizabeth","April, 2011","\"The purchase of my condo and the sale of my house were handled completely. Thank you!\""]
["kmts0071","ON","Mary","April, 2011","\"Selling before Xmas was not an easy market but you worked your magic & made it all happen!!!\""]
["kmts0072","ON","Mike & Leslie","July, 2011","\"Great service from Jeff Vedan. Clearly listened to our needs and requirements. We wanted very little time viewing properties that didn't fit for us\"."]
["kmts0073","ON","Diane","July, 2001","\"From the first discussion regarding the sale of our home throughout the sale to the final closing we felt immensely comfortable with the Karen Millar Team. We couldn't have wished for or imagined a better outcome\"."]
["kmts0074","ON","Heather","July, 2001","\"Well, where do I start.  Appointing you and the \"gang\" as our realtor was exceedingly easy for us.  You presented yourself  very professionally and confident, and just the type of woman we would be comfortable working with. \nAll that before you mentioned the team.  That was the icing on the cake.  As you know the project of getting Mom's house on the market was an overwhelming task.  It was accomplished by all the hard work and support of our entire families on both sides.  We were very impressed with your approach which aligned exactly with our own.  We were pleased to continue with the FAMILY theme.\""]
["kmts0075","ON","Cathy & John","July, 2011","\"Thanks Karen - during a difficult time for our family it was so nice to have a completely worry-free sale of our house. Nice job!\""]
["kmts0076","ON","Lisa","August, 2011","\"Great service. Thorough, personalized. Couldn't ask for more!\""]
["kmts0077","ON","Steve & Judy","September, 2011","\"Thank you again Karen for selling our home! You and your team did an excellent job of selling out home quickly, for a great price and with great efficiency. I would recommend the Karen Millar Team!!\""]
["kmts0078","ON","John & Carolyn","September, 2011","\"Thank you all so much for helping us sell & buy our homes. You are all the best!!!\""]
["kmts0079","ON","Connie and George","January, 2012","\"Thank you so much for all the work on our house sale. From Ian's fix ups to Dana's photography it was an amazing experience for us. Karen, your professionalism and enthusiasm are contagious. You have given us a whole new perspective on the selling process. And thanks to everyone on the team, we can now go shopping for a new home with confidence.\" "]
["kmts0080","ON","Ward & Nisa","2012-02-01","\"Great advice on what we should do to improve our home for showings to maximize the affect on potential buyers. This was very helpful!\""]
["kmts0081","ON","Jaime Lynn Greenwood",2012,"\"Jeff was awesome! He helped me find exactly what I was looking for. He was very patient & helped me take my time to find the right condo. Thanks Jeff!\""]
["kmts0082","ON","Peggy & Andre",2012,"\"We have used and recommended the Millar Team on numerous occasions and each time they make you feel like you are their only client. They are always available and the fact that they have a team provides you with a great sense of confidence. Their courtesy & respect is always soothing in such a stressful time.\""]
["kmts0083","ON","Anandhi","2012-10-01","\"Buying and selling is a stressful process. It's hard to know if you get what you're house is worth and if you overpay for a new property. The Millar Team was great through the process.\""]
["kmts0084","ON","Pablo & Militza","2012-10-01","\"We knew from our previous purchase experience that your team was excellent!'"]
["kmts0085","ON","Kimberley","2012-11-01","\"We were thrilled by the level of professionalism & expertise of the Millar Team. You all worked together like a well-oiled machine. We felt respected & listened to. I would never sell a house in Toronto without the Millar Team\""]
["kmts0086","ON","Denis & Susana","2012-12-01","\"Thanks! You guys did a great job!\""]
["kmts0087","ON","Rein","2012-12-01"," \"You did very well. Keep up your good work!'"]
["kmts0088","ON","Claudiu","2012-12-01","\"It was an absolute pleasure dealing with your team, as usual. Many thanks. I would never hesitate to send someone in need of real estate advice/service to you.\""]
["kmts0089","ON","Tom","2012-12-01"," \"You know you are in good hands when working with the Karen Millar Team!'"]
["kmts0090","ON","Stephen & Hazel"," Jan -13"," \"We found Karen and the Team to be responsive, knowledgeable, realistic, supportive and professional - while maintaining a friendly and trusting relationship. We were impressed with the service and the results.\""]
["kmts0091","ON","William & Elizabeth","2013-02-13"," \"Thanks Karen and Jeff for your professionalism, your enthusiasm & your good advice. You kept us calm in a condo market full of conflicting opinions. A prompt sale at full asking price and an un-eventful closing - who can ask for more?\""]
["kmts0092","ON","Rod & Beryl","2013-04-01"," \"Dear Karen & Family, Thank you so much for your card, the generous subscription & invites. House & Home will definitely come in handy for our new place. We are loving Liberty Village and we are settled and home! We could never thank you enough for all the wonderful service you provided to help us sell our condo. It was a very long and sometimes stressful journey, until the moment we met you. we knew we could count on you to get it sold quickly. You guys exceeded our expectations, the staging - Beautiful! And you took care of all the details swiftly and with the upmost professionalism and caring. Thank you, thank you, thank you. You have clients and friends for life. All the best to you!!!\""]
["kmts0093","ON","Mary","2013-04-01","\"Karen, Ian & your team were above & beyond what I expected regarding the selling of our home. Your more than complete service looking after me on behalf of Bill was superb! I have and will continue to refer you Karen & your team with the utmost confidence and I personally thank you ALL once again\""]
["kmts0094","ON","Marg & Jim","2013-10-01","\"Dear Karen,\nWe just wanted to extend our thanks to you and The Karen Millar Team for your help in the sale and purchase of our homes recently.\nWe enjoyed the benefits of all your team members and we knew that you and your staff were there to help us all the time.\nIt was very helpful to have your experience and recommendations during our downsizing exercise.\"\nBest regards,\nMarg & Jim"]
["kmts0095","ON","Jeff & Juan","2013-12-01","\"Excellent Services!! Thanks so much Karen & your entire family!\""]
["kmts0096","ON","Walt, Emily and Helen","2014-01-01","\"We would like to thank The Karen Millar Team for helping us buy a new home and sell our old one. They conducted each step with grace and propriety and were attentive to every detail. We appreciate Dana’s photographs, her work on publicity and Ian’s aid in the staging of our home. We are especially grateful to Karen and Jeff for their hard work and professionalism throughout the entire process, from giving us daily feedback to hosting meetings for our closings. We would recommend The Karen Millar Team to anyone selling or buying a house and we definitely look forward to working with them again.\""]
["kmts0097","ON","Dale & Toshie","2013-12-01","\"Dear Karen, Thank you so much for helping us sell our home. We were so happy to find you and were really impressed with your hard work\""]
["kmts0098","ON","Jamie & Vera","2014-12-01"," \"Personalized Service & Professional Performance! Thank you for your superb customer service and your ongoing assistance with all of our real estate needs!\""]
["kmts0099","ON","Mark & Kim","2014-12-01","\"Love, love, love Karen, Ian & Jamie. Everyone!!  We are in love with our home!\""]
["kmts0100","ON","Jack & Debra","2014-03-27","\"Karen, Jack & I can’t thank you, Ian & your team enough for how much you helped us out of a bind. I wish I would have met you sooner. You have become my new \"best\" agent! (& friend) We can't say enough about your incredible team.\""]
["kmts0101","ON","Gordon","2014-03-26","\"Karen and her team did a fantastic job on the sale of my house. They absolutely know the market conditions and negotiated a great price.\""]
["kmts0102","ON","Steve & Jane","2014-04-14","\"Karen, and all the Millar team: Jane and I extend our sincerest thanks for the excellent work you all provided in completing our sale. It is a pleasure to see professionals who know how to manage their business, and treat their clients and partners with respect. We were so impressed with your understanding of the process, the guidance you provided and the support from the team in every aspect. We know that you set high standards and expectations, and believe you definitely exceeded our expectations on this transaction\""]
["kmts0103","OFF"]
["kmts0104","OFF"]
["kmts0105","OFF"]
["kmts0106","OFF"]
["kmts0107","OFF"]
["kmts0108","OFF"]
["kmts0109","OFF"]
["kmts0110","OFF"]
["kmts0111","OFF"]
["kmts0112","OFF"]
["kmts0113","OFF"]
["kmts0114","OFF"]
["kmts0115","OFF"]
["kmts0116","OFF"]
["kmts0117","OFF"]
["kmts0118","OFF"]
["kmts0119","OFF"]
["kmts0120","OFF"]
["kmts0121","OFF"]
["kmts0122","OFF"]
["kmts0123","OFF"]
["kmts0124","OFF"]
["kmts0125","OFF"]
["kmts0126","OFF"]
["kmts0127","OFF"]
["kmts0128","OFF"]
["kmts0129","OFF"]
["kmts0130","OFF"]
["kmts0131","OFF"]
["kmts0132","OFF"]
["kmts0133","OFF"]
["kmts0134","OFF"]
["kmts0135","OFF"]
["kmts0136","OFF"]
["kmts0137","OFF"]
["kmts0138","OFF"]
["kmts0139","OFF"]
["kmts0140","OFF"]
["kmts0141","OFF"]
["kmts0142","OFF"]
["kmts0143","OFF"]
["kmts0144","OFF"]
["kmts0145","OFF"]
["kmts0146","OFF"]
["kmts0147","OFF"]
["kmts0148","OFF"]
["kmts0149","OFF"]
["kmts0150","OFF"]

{"sheet":"Lookups","index":5,"n_rows":56,"n_cols":6,"rows_kept":56,"cut":false,"hidden":false,"merged":[]}
["listing_status","listing_type","news_type","tip_type","trade_type","trade_id"]
["NEW","Luxury","ECO","ECO","Banks/Mortgages","t01"]
["SOLD","Executive",null,null,"Contractors","t02"]
["ARCHIVE","Family Residential",null,null,"Floors","t03"]
["OFFLINE","Condo",null,null,"Foundations","t04"]
["LEASE","Renovator",null,null,"Home Inspectors","t05"]
[null,"First Time Buyer",null,null,"Junk Removal","t06"]
[null,null,null,null,"Labour","t07"]
[null,null,null,null,"Lawyers","t08"]
[null,null,null,null,"Mold","t09"]
[null,null,null,null,"Movers","t10"]
[null,null,null,null,"Oil Tank Removal","t11"]
[null,null,null,null,"Painters","t12"]
[null,null,null,null,"Pest Control","t13"]
[null,null,null,null,"Piano Mover","t14"]
[null,null,null,null,"Plumbing","t15"]
[null,null,null,null,"Pools","t16"]
[null,null,null,null,"Roofers","t17"]
[null,null,null,null,"Seniors","t18"]
[null,null,null,null,"Staging","t19"]
[null,null,null,null,"Storage","t20"]
[null,null,null,null,"Tilers","t21"]
[null,null,null,null,"Upholstery","t22"]
[null,null,null,null,"Utilities","t23"]
[null,null,null,null,"Waterproofing","t24"]
[null,null,null,null,"Windows","t25"]
[null,null,null,null,"Financial Advisor","t26"]
[null,null,null,null,"Cleaning Company","t27"]
[null,null,null,null,"Rentals","t28"]
[null,null,null,null,"Tree Care/Gardening","t29"]
[null,null,null,null,"Fences","t30"]
[null,null,null,null,"Contents","t31"]
[null,null,null,null,"Heating & Cooling","t32"]
[null,null,null,null,"Surveyors","t33"]
[null,null,null,null,"Paving","t34"]
[null,null,null,null,"Doctor","t35"]
[null,null,null,null,"Dentist","t36"]
[null,null,null,null,"Veterinarian","t37"]
[null,null,null,null,"Funeral Home","t38"]
[null,null,null,null,"Locksmith","t39"]
[null,null,null,null,"Electrician","t40"]
[null,null,null,null,"Limousine Service","t41"]
[null,null,null,null,"Drapery","t42"]
[null,null,null,null,"Personal Trainer","t43"]
[null,null,null,null,"Designer/Architect","t44"]
[null,null,null,null,"Organizing","t45"]
[null,null,null,null,"Computers & IT","t46"]
[null,null,null,null,"Specialty Shops","t47"]
[null,null,null,null,"Disaster Recovery","t48"]
[null,null,null,null,"Pet Care","t49"]
[null,null,null,null,"Feng Shui","t50"]
[null,null,null,null,"Chinese Medicine","t51"]
[null,null,null,null,"Vermiculite","t52"]
[null,null,null,null,"Fridge or Freezer Removal","t53"]
[null,null,null,null,"Scrap Collector","t54"]
[null,null,null,null,"Kitchens & Cabinetry","t55"]

{"sheet":"Slides","index":6,"n_rows":4173,"n_cols":3,"rows_kept":4173,"cut":false,"hidden":false,"merged":[],"read":"row_number_cap"}
["Karen Millar Tips"]
[]
["property_id","pic_id","caption"]
["km000337","01","Front"]
["km000337","02","Foyer"]
["km000337","03","Foyer"]
["km000337","04","Foyer"]
["km000337","05","Foyer"]
["km000337","06","Living Room"]
["km000337","07","Living Room"]
["km000337","08","Living Room"]
["km000337","09","Dining Room"]
["km000337","10","Dining Room"]
["km000337","11","Kitchen"]
["km000337","12","Kitchen"]
["km000337","13","Kitchen"]
["km000337","14","Kitchen"]
["km000337","15","Kitchen"]
["km000337","16","Breakfast Area"]
["km000337","17","Family Room"]
["km000337","18","Family Room"]
["km000337","19","Family Room"]
["km000337","20","Family Room"]
["km000337","21","Family Room"]
["km000337","22","Family Room"]
["km000337","23","Office"]
["km000337","24","Powder Room"]
["km000337","25","Upper Hallway"]
["km000337","26","Upper Hallway"]
["km000337","27","Master Bedroom"]
["km000337","28","Master Bedroom"]
["km000337","29","Master Bedroom"]
["km000337","30","Ensuite"]
["km000337","31","Upper Office"]
["km000337","32","Rec Room"]
["km000337","33","Rec Room"]
["km000337","34","Fireplace Room"]
["km000337","35","Guest Bedroom"]
["km000337","36","Bathroom"]
["km000337","37","Sauna"]
["km000337","38","Bathroom"]
["km000337","39","Backyard"]
["km000337","40","Backyard"]
["km000337","41","Backyard"]
["km000356","01","Front"]
["km000356","02","Pool"]
["km000356","03","Pool"]
["km000356","04","Pool"]
["km000356","05","Patio"]
["km000356","06","Pool"]
["km000356","07","Patio"]
["km000356","08","Deck"]
["km000356","09","Deck"]
["km000356","10","Patio"]
["km000356","11","Foyer"]
["km000356","12","Foyer"]
["km000356","13","Foyer"]
["km000356","14","Foyer"]
["km000356","15","Library"]
["km000356","16","Living Room"]
["km000356","17","Living Room"]
["km000356","18","Dining Room"]
["km000356","19","Kitchen"]
["km000356","20","Kitchen"]
["km000356","21","Kitchen"]
["km000356","22","Kitchen"]
["km000356","23","Family Room"]
["km000356","24","Family Room"]
["km000356","25","Grand Master Bedroom"]
["km000356","26","Grand Master Bedroom"]
["km000356","27","Grand Master Ensuite"]
["km000356","28","Grand Master Ensuite"]
["km000356","29","Master Bedroom"]
["km000356","30","Master Bedroom"]
["km000356","31","Master Ensuite"]
["km000356","32","Master Ensuite"]
["km000356","33","Bedroom"]
["km000356","34","Bedroom Walkout"]
["km000356","35","Bedroom Ensuite"]
["km000356","36","Second Bedroom"]
["km000356","37","Second Bedroom Ensuite"]
["km000356","38","Rec Room"]
["km000356","39","Rec Room"]
["km000356","40","Games Room"]
["km000356","41","Games Room"]
["km000356","42","Bar"]
["km000356","43","Theatre Room"]
["km000356","44","Guest Bedroom"]
["km000363","01","Front"]
["km000363","02","Backyard"]
["km000363","03","Backyard"]
["km000363","04","Backyard"]
["km000363","05","Backyard"]
["km000363","06","Backyard"]
["km000363","07","Foyer"]
["km000363","08","Living Room"]
["km000363","09","Living Room"]
["km000363","10","Dining Room"]
["km000363","11","Kitchen"]
["km000363","12","Kitchen"]
["km000363","13","Eat-in"]
["km000363","14","Family Room"]
["km000363","15","Den"]
["km000363","16","Master Bedroom"]
["km000363","17","Ensuite"]
["km000363","18","Bedroom"]
["km000363","19","Bedroom"]
["km000363","20","Bedroom"]
["km000363","21","Bathroom"]
["km000363","22","Recreation Room"]
["km000363","23","Games Room"]
["km000362","01","Front"]
["km000362","02","Backyard"]
["km000362","03","Backyard"]
["km000362","04","Foyer"]
["km000362","05","Living/Dining Room"]
["km000362","06","Living/Dining Room"]
["km000362","07","Kitchen"]
["km000362","08","Master Bedroom"]
["km000362","09","Bathroom"]
["km000362","10","Bedroom"]
["km000362","11","Bedroom"]
["km000362","12","Living Room"]
["km000362","13","Living Room"]
["km000362","14","Kitchen"]
["km000362","15","Bedroom"]
["km000362","16","Recreation Room"]
["km000362","17","Recreation Room"]
["km000364","01","Front"]
["km000364","02","Front"]
["km000364","03","Backyard"]
["km000364","04","Backyard"]
["km000364","05","Backyard"]
["km000364","06","Living Room"]
["km000364","07","Bedroom/Office"]
["km000364","08","Kitchen"]
["km000364","09","Dining Room"]
["km000364","10","Family Room"]
["km000364","11","Family Room"]
["km000364","12","Bedroom"]
["km000364","13","Bedroom"]
["km000364","14","Bathroom"]
["km000364","15","Recreation Room"]
["km000365","01","Front"]
["km000365","02","Backyard"]
["km000365","03","Living Room"]
["km000365","04","Dining Room"]
["km000365","05","Kitchen"]
["km000365","06","Kitchen"]
["km000365","07","Master Bedroom"]
["km000365","08","Bedroom"]
["km000365","09","Bedroom"]
["km000365","10","Bathroom"]
["km000365","11","Bedroom"]
["km000365","12","Recreation Room"]
["km000366","01","Front"]
["km000366","02","Backyard"]
["km000366","03","Backyard"]
["km000366","04","Foyer"]
["km000366","05","Foyer"]
["km000366","06","Living Room"]
["km000366","07","Living Room"]
["km000366","08","Living Room"]
["km000366","09","Dining Room"]
["km000366","10","Kitchen"]
["km000366","11","Kitchen"]
["km000366","12","Kitchen"]
["km000366","13","Master Bedroom"]
["km000366","14","Bathroom"]
["km000366","15","Laundry "]
["km000366","16","Bedroom"]
["km000366","17","Bedroom"]
["km000366","18","Family Room"]
["km000366","19","Family Room"]
["km000366","20","Recreation Room"]
["km000366","21","Bathroom"]
["km000367","01","Front"]
["km000367","02","Backyard"]
["km000367","03","Backyard"]
["km000367","04","Living Room"]
["km000367","05","Living Room"]
["km000367","06","Dining Room"]
["km000367","07","Kitchen"]
["km000367","08","Kitchen"]
["km000367","09","Bedroom"]
["km000367","10","Bedroom"]
["km000367","11","Bedroom"]
["km000367","12","Bathroom"]
["km000367","13","Recreation Room"]
["km000367","14","Bathroom"]
["km000367","15","Kitchen"]
["km000367","16","Bedroom"]
["km000367","17","Bedroom"]
["km000352","01","Front"]
["km000352","02","Backyard"]
["km000352","03","Living, Dining & Kitchen"]
["km000352","04","Kitchen"]
["km000352","05","Dining Room"]
["km000352","06","Living Room"]
["km000352","07","Master Bedroom"]
["km000352","08","Bathroom"]
["km000352","09","Bedroom"]
["km000352","10","Bedroom"]
["km000352","11","Bathroom"]
["km000352","12","Recreation Room"]
["km000371","01","Front"]
["km000371","02","Backyard"]
["km000371","03","Backyard"]
["km000371","04","Backyard"]
["km000371","05","Foyer"]
["km000371","06","Living Room"]
["km000371","07","Living Room"]
["km000371","08","Dining Room"]
["km000371","09","Dining Room"]
["km000371","10","Kitchen"]
["km000371","11","Kitchen"]
["km000371","12","Master Bedroom"]
["km000371","13","Ensuite Bathroom"]
["km000371","14","Bedroom"]
["km000371","15","Bedroom"]
["km000371","16","Bathroom"]
["km000371","17","Recreation Room"]
["km000371","18","Recreation Room"]
["km000371","19","Bathroom"]
["km000371","20","Office"]
["km000369","01","Front"]
["km000369","02","Backyard"]
["km000369","03","Backyard"]
["km000369","04","Kitchen"]
["km000369","05","Dining Room"]
["km000369","06","Den"]
["km000369","07","Bathroom"]
["km000369","08","Bedroom"]
["km000369","09","Family Room"]
["km000369","10","Family Room"]
["km000369","11","Family Room"]
["km000369","12","Master Bedroom"]
["km000369","13","Bedroom"]
["km000369","14","Bathroom"]
["km000372","01","Front"]
["km000372","02","Backyard"]
["km000372","03","Living Room"]
["km000372","04","Living Room & Dining Room"]
["km000372","05","Dining Room & Living Room"]
["km000372","06","Dining Room"]
["km000372","07","Kitchen"]
["km000372","08","Master Bedroom"]
["km000372","09","Bedroom"]
["km000372","10","Bedroom"]
["km000372","11","Living Room"]
["km000372","12","Recreation Room"]
["km000372","13","Backyard"]
["km000368","01","Front"]
["km000368","02","Backyard"]
["km000368","03","Backyard"]
["km000368","04","Backyard"]
["km000368","05","Backyard"]
["km000368","06","Living Room"]
["km000368","07","Living Room"]
["km000368","08","Living Room"]
["km000368","09","Living Room"]
["km000368","10","Dining Room"]
["km000368","11","Kitchen"]
["km000368","12","Breakfast Area"]
["km000368","13","Master Bedroom"]
["km000368","14","Ensuite Bathroom"]
["km000368","15","Bedroom"]
["km000368","16","Bathroom"]
["km000368","17","Family Room"]
["km000368","18","Family Room"]
["km000368","19","Family Room"]
["km000368","20","Recreation Room"]
["km000368","21","Recreation Room"]
["km000368","22","Family Room"]
["km000368","23","Bedroom"]
["km000373","01","Front"]
["km000373","02","Front Exterior"]
["km000373","03","Backyard"]
["km000373","04","Backyard"]
["km000373","05","Foyer"]
["km000373","06","Living Room"]
["km000373","07","Living Room"]
["km000373","08","Living Room"]
["km000373","09","Kitchen"]
["km000373","10","Kitchen"]
["km000373","11","Dining Room"]
["km000373","12","Dining Room"]
["km000373","13","Office"]
["km000373","14","Master Bedroom"]
["km000373","15","Bathroom"]
["km000373","16","Bedroom"]
["km000373","17","Bedroom"]
["km000373","18","Family Room"]
["km000373","19","Family Room"]
["km000373","20","Bedroom"]
["km000373","21","Bathroom"]
["km000373","22","Recreation Room"]
["km000359","01","Front"]
["km000359","02","Carport"]
["km000359","03","Backyard"]
["km000359","04","View of Backyard from Master Bedroom"]
["km000359","05","Backyard"]
["km000359","06","Backyard"]
["km000359","07","Foyer"]
["km000359","08","Media Room"]
["km000359","09","Media Room"]
["km000359","10","Living Room"]
["km000359","11","Living Room"]
["km000359","12","Living Room"]
["km000359","13","Living Room "]
["km000359","14","Living Room"]
["km000359","15","Dining Room"]
["km000359","16","Kitchen"]
["km000359","17","Kitchen"]
["km000359","18","Kitchen"]
["km000359","19","Kitchen"]
["km000359","20","Breakfast Area"]
["km000359","21","Kitchen Office Nook"]
["km000359","22","Master Bedroom"]
["km000359","23","Den"]
["km000359","24","Cedar Ceiling Beams"]
["km000359","25","Bedroom"]
["km000359","26","Bedroom"]
["km000359","27","Bedroom"]
["km000359","28","Bathroom"]
["km000359","29","Bathroom"]
["km000359","30","Bathroom"]
["km000359","31","Office"]
["km000359","32","Recreation Room"]
["km000359","33","Backyard"]
["km000359","34","Backyard"]
["km000359","35","Backyard"]
["km000359","36","Backyard"]
["km000359","37","Backyard"]
["km000359","38","Toboganning Hill"]
["km000359","39","Silent Hill Filming"]
["km000359","40","Silent Hill Filming"]
["km000359","41","Silent Hill Filming"]
["km000359","42","Silent Hill Filming"]
["km000359","43","Ravine in Autumn"]
["km000374","01","Front"]
["km000374","02","Backyard"]
["km000374","03","Backyard"]
["km000374","04","Living Room"]
["km000374","05","Living Room"]
["km000374","06","Dining Room"]
["km000374","07","Kitchen"]
["km000374","08","Master Bedroom"]
["km000374","09","Bedroom"]
["km000374","10","Bathroom"]
["km000374","11","Recreation Room"]
["km000374","12","Office"]
["km000375","01","Front"]
["km000375","02","Front Exterior"]
["km000375","03","Living Room"]
["km000375","04","Dining Room"]
["km000375","05","Kitchen"]
["km000375","06","Breakfast Area"]
["km000375","07","Bedroom"]
["km000375","08","Bedroom"]
["km000375","09","Bedroom"]
["km000375","10","Bedroom"]
["km000375","11","Bathroom"]
["km000375","12","Basement Bedroom"]
["km000375","13","Bathroom"]
["km000375","14","Recreation Room"]
["km000370","01","Front"]
["km000370","02","Backyard"]
["km000370","03","Living Room"]
["km000370","04","Dining Room"]
["km000370","05","Living/Dining Room"]
["km000370","06","Kitchen"]
["km000370","07","Breakfast Area"]
["km000370","08","Breakfast Area"]
["km000370","09","Office"]
["km000370","10","Upper Level Hallway"]
["km000370","11","Master Bedroom"]
["km000370","12","Recreation Room"]
["km000378","01","Front"]
["km000378","02","Balcony View"]
["km000378","03","Balcony"]
["km000378","04","Living Room"]
["km000378","05","Living/Dining Room"]
["km000378","06","Dining Room"]
["km000378","07","Kitchen"]
["km000378","08","Breakfast Area"]
["km000378","09","Master Bedroom"]
["km000378","10","Ensuite Bedroom"]
["km000378","11","Bedroom"]
["km000378","12","Bathroom"]
["km000378","13","Den"]
["km000377","01","Front"]
["km000377","02","Backyard"]
["km000377","03","Living Room"]
["km000377","04","Living Room"]
["km000377","05","Dining Room"]
["km000377","06","Kitchen"]
["km000377","07","Master Bedroom"]
["km000377","08","Ensuite Bathroom"]
["km000377","09","Bedroom"]
["km000377","10","Bedroom"]
["km000377","11","Bathroom"]
["km000377","12","Recreation Room"]
["km000377","13","Basement Bedroom"]
["km000377","14","Basement Bedroom"]
["km000379","01","Front"]
["km000379","02","Backyard"]
["km000379","03","Backyard"]
["km000379","04","Backyard"]
["km000379","05","Backyard"]
["km000379","06","Porch"]
["km000379","07","Living Room"]
["km000379","08","Dining Room"]
["km000379","09","Kitchen"]
["km000379","10","Kitchen"]
["km000379","11","Breakfast Area"]
["km000379","12","Master Bedroom"]
["km000379","13","Bedroom"]
["km000379","14","Bedroom"]
["km000379","15","Recreation Room"]
["km000379","16","Basement Bedroom"]
["km000380","01","Front"]
["km000380","02","Backyard"]
["km000380","03","Backyard"]
["km000380","04","Sideyard"]
["km000380","05","Foyer"]
["km000380","06","Kitchen"]
["km000380","07","Kitchen"]
["km000380","08","Dining Room"]
["km000380","09","Living Room"]
["km000380","10","Living Room"]
["km000380","11","Living Room"]
["km000380","12","Family Room"]
["km000380","13","Master Bedroom"]
["km000380","14","Ensuite Bathroom"]
["km000380","15","Bedroom"]
["km000380","16","Bedroom"]
["km000380","17","Bathroom"]
["km000380","18","Recreation Room"]
["km000380","19","Recreation Room"]
["km000380","20","Spa"]
["km000380","21","Spa"]
["km000380","22","Basement Bathroom"]
["km000380","23","Basement Bedroom"]
["km000383","01","Front"]
["km000383","02","Backyard"]
["km000383","03","Backyard"]
["km000383","04","Backyard"]
["km000383","05","Backyard"]
["km000383","06","Foyer"]
["km000383","07","Living Room"]
["km000383","08","Living Room"]
["km000383","09","Dining Room"]
["km000383","10","Kitchen"]
["km000383","11","Kitchen"]
["km000383","12","Den"]
["km000383","13","Solarium"]
["km000383","14","Master Bedroom"]
["km000383","15","Master Bedroom"]
["km000383","16","Bathroom"]
["km000383","17","Bedroom"]
["km000383","18","Bedroom"]
["km000383","19","Recreation Room"]
["km000384","01","Front"]
["km000384","02","Backyard"]
["km000384","03","Living Room"]
["km000384","04","Living Room"]
["km000384","05","Dining Room"]
["km000384","06","Kitchen"]
["km000384","07","Master Bedroom"]
["km000384","08","Bedroom"]
["km000384","09","Bedroom"]
["km000386","01","Front"]
["km000386","02","Backyard"]
["km000386","03","Living Room"]
["km000386","04","Living Room"]
["km000386","05","Dining Room"]
["km000386","06","Kitchen"]
["km000386","07","Breakfast Area"]
["km000386","08","Master Bedroom"]
["km000386","09","Bedroom"]
["km000386","10","Recreation Room"]
["km000388","01","Front"]
["km000388","02","Living Room"]
["km000388","03","Living & Dining Room"]
["km000388","04","Dining Room"]
["km000388","05","Living Room"]
["km000388","06","Kitchen"]
["km000388","07","Kitchen"]
["km000388","08","Balcony View"]
["km000388","09","Balcony View"]
["km000388","10","Master Bedroom"]
["km000388","11","Bathroom"]
["km000388","12","Rooftop View"]
["km000388","13","Rooftop Views"]
["km000388","14","Rooftop Views"]
["km000388","15","Lounge"]
["km000388","16","Lounge"]
["km000385","01","Front"]
["km000385","02","Backyard"]
["km000385","03","Backyard"]
["km000385","04","Backyard"]
["km000385","05","Dining Room"]
["km000385","06","Kitchen"]
["km000385","07","Breakfast Area"]
["km000385","08","Family Room"]
["km000385","09","Master Bedroom"]
["km000385","10","Ensuite Bathroom"]
["km000385","11","Bedroom"]
["km000385","12","Bedroom"]
["km000385","13","Bedroom"]
["km000385","14","Bathroom"]
["km000385","15","Office"]
["km000385","16","Recreation Room"]
["km000385","17","Recreation Room"]
["km000389","01","Front"]
["km000389","02","Backyard"]
["km000389","03","Living Room"]
["km000389","04","Dining Room"]
["km000389","05","Kitchen"]
["km000389","06","Breakfast Area"]
["km000389","07","Master Bedroom"]
["km000389","08","Bedroom"]
["km000389","09","Bedroom"]
["km000389","10","Bathroom"]
["km000389","11","Recreation Room"]
["km000389","12","Games Room"]
["km000389","13","Bedroom/Office"]
["km000390","01","Front"]
["km000390","02","Backyard"]
["km000390","03","Backyard"]
["km000390","04","Living Room"]
["km000390","05","Living Room"]
["km000390","06","Dining Room"]
["km000390","07","Dining Room"]
["km000390","08","Kitchen"]
["km000390","09","Kitchen"]
["km000390","10","Master Bedroom"]
["km000390","11","Bedroom"]
["km000390","12","Bedroom"]
["km000390","13","Bathroom"]
["km000390","14","Recreation Room"]
["km000390","15","Recreation Room"]
["km000390","16","Games Room"]
["km000390","17","Laundry "]
["km000391","01","Front"]
["km000391","02","Sideyard"]
["km000391","03","Backyard"]
["km000391","04","Backyard"]
["km000391","05","Backyard"]
["km000391","06","Kitchen"]
["km000391","07","Kitchen"]
["km000391","08","Kitchen"]
["km000391","09","Dining Room"]
["km000391","10","Dining Room"]
["km000391","11","Living/Family Room"]
["km000391","12","Living/Family Room"]
["km000391","13","Living/Family Room"]
["km000391","14","Master Bedroom"]
["km000391","15","Bedroom/Office"]
["km000391","16","Bathroom"]
["km000391","17","Bathroom"]
["km000392","01","Front"]
["km000392","02","Backyard"]
["km000392","03","Balcony"]
["km000392","04","Kitchen"]
["km000392","05","Kitchen"]
["km000392","06","Living Room"]
["km000392","07","Dining Room"]
["km000392","08","Dining Room"]
["km000392","09","Family Room"]
["km000392","10","Family Room"]
["km000392","11","Family Room"]
["km000392","12","Office"]
["km000392","13","Master Bedroom"]
["km000392","14","2 Piece Bathroom"]
["km000392","15","Recreation Room"]
["km000392","16","Bedroom"]
["km000393","01","Front"]
["km000393","02","Backyard"]
["km000393","03","Backyard"]
["km000393","04","Backyard"]
["km000393","05","Living Room"]
["km000393","06","Living/Dining Room"]
["km000393","07","Dining Room"]
["km000393","08","Dining Room"]
["km000393","09","Kitchen"]
["km000393","10","Master Bedroom"]
["km000393","11","Bathroom"]
["km000393","12","Bedroom"]
["km000393","13","Den"]
["km000393","14","Recreation Room"]
["km000393","15","Recreation Room"]
["km000393","16","Recreation Room"]
["km000387","01","Front"]
["km000387","02","Backyard"]
["km000387","03","Backyard"]
["km000387","04","Backyard"]
["km000387","05","Backyard"]
["km000387","06","Foyer"]
["km000387","07","Foyer"]
["km000387","08","Living Room"]
["km000387","09","Living Room"]
["km000387","10","Living Room"]
["km000387","11","Kitchen"]
["km000387","12","Kitchen"]
["km000387","13","Dinette"]
["km000387","14","Dining Room"]
["km000387","15","Master Bedroom"]
["km000387","16","Master Bedroom"]
["km000387","17","Ensuite Bathroom"]
["km000387","18","Closet"]
["km000387","19","Closet"]
["km000387","20","Office"]
["km000387","21","Office"]
["km000387","22","Bathroom"]
["km000387","23","Recreation Room"]
["km000387","24","Basement Bedroom"]
["km000387","25","Basement Bedroom"]
["km000387","26","Exercise Room"]
["km000387","27","Basement Bathroom"]
["km000395","01","Front"]
["km000395","02","Backyard"]
["km000395","03","Backyard"]
["km000395","04","Living Room"]
["km000395","05","Living Room"]
["km000395","06","Dining Room"]
["km000395","07","Kitchen"]
["km000395","08","Kitchen"]
["km000395","09","Master Bedroom"]
["km000395","10","Bedroom"]
["km000395","11","Bedroom"]
["km000395","12","Bathroom"]
["km000395","13","Recreation Room"]
["km000395","14","Recreation Room"]
["km000394","01","Front"]
["km000394","02","Backyard"]
["km000394","03","Backyard"]
["km000394","04","Living Room"]
["km000394","05","Living Room"]
["km000394","06","Living Room & Dining Room"]
["km000394","07","Dining Room"]
["km000394","08","Kitchen"]
["km000394","09","Master Bedroom"]
["km000394","10","Bathroom"]
["km000394","11","Bedroom"]
["km000394","12","Recreation Room"]
["km000394","13","Bedroom"]
["km000394","14","Bedroom"]
["km000397","01","Front"]
["km000397","02","Backyard"]
["km000397","03","Backyard"]
["km000397","04","Living Room"]
["km000397","05","Living Room"]
["km000397","06","Living Room"]
["km000397","07","Dining Room"]
["km000397","08","Dining Room"]
["km000397","09","Kitchen"]
["km000397","10","Kitchen"]
["km000397","11","Family Room"]
["km000397","12","Family Room"]
["km000397","13","Family Room"]
["km000397","14","Family Room"]
["km000397","15","Master Bedroom"]
["km000397","16","Bedroom"]
["km000397","17","Bedroom"]
["km000397","18","Bathroom"]
["km000397","19","Recreation Room"]
["km000397","20","Recreation Room"]
["km000397","21","Recreation Room"]
["km000397","22","Basement Bathroom"]
["km000397","23","Basement Bedroom"]
["km000396","01","Front"]
["km000396","02","Backyard"]
["km000396","03","Backyard"]
["km000396","04","Living Room"]
["km000396","05","Living Room"]
["km000396","06","Living Room"]
["km000396","07","Dining Room"]
["km000396","08","Kitchen"]
["km000396","09","Kitchen"]
["km000396","10","Breakfast Area"]
["km000396","11","Laundry "]
["km000396","12","Bedroom"]
["km000396","13","Bedroom"]
["km000396","14","Bedroom"]
["km000396","15","Bathroom"]
["km000396","16","Bathroom"]
["km000399","01","Front"]
["km000399","02","Terrace"]
["km000399","03","Backyard"]
["km000399","04","Kitchen"]
["km000399","05","Kitchen"]
["km000399","06","Living Room"]
["km000399","07","Living Room"]
["km000399","08","Living Room"]
["km000399","09","Dining Room"]
["km000399","10","Dining Room"]
["km000399","11","Family Room"]
["km000399","12","Family Room"]
["km000399","13","Family Room"]
["km000399","14","Master Bedroom"]
["km000399","15","Ensuite Bathroom"]
["km000399","16","Bedroom"]
["km000399","17","Bedroom"]
["km000399","18","Bathroom"]
["km000399","19","Basement Bathroom"]
["km000398","01","Front"]
["km000398","02","Backyard"]
["km000398","03","Dining/Living Room"]
["km000398","04","Living Room"]
["km000398","05","Living/Dining Room"]
["km000398","06","Dining Room"]
["km000398","07","Solarium"]
["km000398","08","Kitchen"]
["km000398","09","Kitchen"]
["km000398","10","Master Bedroom"]
["km000398","11","Bathroom"]
["km000398","12","Bedroom"]
["km000398","13","Bedroom"]
["km000398","14","Recreation Room"]
["km000398","15","Recreation Room"]
["km000398","16","Recreation Room"]
["km000398","17","Office"]
["km000400","01","Front"]
["km000400","02","Living Room"]
["km000400","03","Dining Room"]
["km000400","04","Kitchen"]
["km000400","05","Kitchen"]
["km000400","06","Balcony"]
["km000400","07","Master Bedroom"]
["km000400","08","Ensuite Bathroom"]
["km000400","09","Den"]
["km000400","10","Bedroom"]
["km000400","11","Bedroom"]
["km000400","12","Bathroom"]
["km000400","13","Recreation Room"]
["km000400","14","Bathroom"]
["km000401","01","Front"]
["km000401","02","Backyard"]
["km000401","03","Foyer"]
["km000401","04","Living Room"]
["km000401","05","Dining Room"]
["km000401","06","Living/Dining Room"]
["km000401","07","Kitchen"]
["km000401","08","Kitchen"]
["km000401","09","Family Room"]
["km000401","10","Master Bedroom"]
["km000401","11","Bathroom"]
["km000401","12","Bedroom"]
["km000401","13","Bedroom"]
["km000401","14","Recreation Room"]
["km000402","01","Front"]
["km000402","02","Foyer/Kitchen/Dining Room"]
["km000402","03","Kitchen"]
["km000402","04","Kitchen"]
["km000402","05","Kitchen"]
["km000402","06","Living Room"]
["km000402","07","Living Room"]
["km000402","08","Dining Room"]
["km000402","09","Dining/Kitchen/Living Room"]
["km000402","10","Master Bedroom"]
["km000402","11","Ensuite Bathroom"]
["km000402","12","Bedroom"]
["km000402","13","Bathroom"]
["km000402","14","Balcony"]
["km000405","01","Front"]
["km000405","02","Backyard"]
["km000405","03","Living Room"]
["km000405","04","Dining Room"]
["km000405","05","Kitchen"]
["km000405","06","Breakfast Area"]
["km000405","07","Master Bedroom"]
["km000405","08","Bedroom"]
["km000405","09","Bedroom"]
["km000405","10","Bedroom"]
["km000405","11","Bathroom"]
["km000406","01","Front"]
["km000406","02","Backyard"]
["km000406","03","Living Room"]
["km000406","04","Living Room"]
["km000406","05","Dining Room"]
["km000406","06","Kitchen"]
["km000406","07","Breakfast Area"]
["km000406","08","Master Bedroom"]
["km000406","09","Bedroom"]
["km000406","10","Bedroom"]
["km000406","11","Bedroom"]
["km000407","01","Front"]
["km000407","02","Walkway"]
["km000407","03","Backyard"]
["km000407","04","Living Room"]
["km000407","05","Living Room"]
["km000407","06","Dining Room"]
["km000407","07","Living/Dining Room"]
["km000407","08","Kitchen"]
["km000407","09","Breakfast Area"]
["km000407","10","Bedroom"]
["km000407","11","Bedroom"]
["km000407","12","Bedroom"]
["km000407","13","Bedroom"]
["km000407","14","Recreation Room"]
["km000407","15","Recreation Room"]
["km000407","16","Workshop"]
["km000407","17","Bathroom"]
["km000408","01","Front"]
["km000408","02","Backyard"]
["km000408","03","Backyard"]
["km000408","04","Living Room"]
["km000408","05","Living/Dining Room"]
["km000408","06","Dining Room"]
["km000408","07","Kitchen"]
["km000408","08","Master Bedroom"]
["km000408","09","4 Piece Bathroom"]
["km000408","10","Bedroom"]
["km000408","11","Recreation Room"]
["km000408","12","Recreation Room"]
["km000408","13","Exercise Room"]
["km000409","01","Front"]
["km000409","02","Backyard"]
["km000409","03","Backyard"]
["km000409","04","Living Room"]
["km000409","05","Kitchen"]
["km000409","06","Dining Room"]
["km000409","07","Master Bedroom"]
["km000409","08","Recreation Room"]
["km000409","09","Bedroom"]
["km000113","01","Front"]
["km000113","02","Backyard"]
["km000113","03","Backyard"]
["km000113","04","Living Room"]
["km000113","05","Dining Room"]
["km000113","06","Kitchen"]
["km000113","07","Master Bedroom"]
["km000113","08","Recreation Room"]
["km000113","09","Bedroom"]
["km000410","01","Front"]
["km000410","02","Backyard"]
["km000410","03","Backyard"]
["km000410","04","Backyard"]
["km000410","05","Backyard"]
["km000410","06","Living Room"]
["km000410","07","Living Room"]
["km000410","08","Kitchen"]
["km000410","09","Kitchen"]
["km000410","10","Kitchen"]
["km000410","11","Bedroom"]
["km000410","12","Bedroom"]
["km000410","13","Bedroom"]
["km000410","14","Bathroom"]
["km000410","15","Family Room"]
["km000410","16","Family Room"]
["km000410","17","Family Room"]
["km000410","18","Bedroom"]
["km000410","19","Recreation Room"]
["km000413","01","Front"]
["km000413","02","Courtyard"]
["km000413","03","Backyard"]
["km000413","04","Backyard"]
["km000413","05","Living Room"]
["km000413","06","Living Room"]
["km000413","07","Kitchen"]
["km000413","08","Breakfast Area"]
["km000413","09","Dining Room"]
["km000413","10","Back Foyer"]
["km000413","11","Back Foyer"]
["km000413","12","Master Bedroom"]
["km000413","13","Master Bedroom"]
["km000413","14","5 Piece Ensuite Bathroom"]
["km000413","15","Bedroom"]
["km000413","16","Bedroom"]
["km000413","17","Bedroom"]
["km000413","18","Bathroom"]
["km000413","19","Recreation Room"]
["km000413","20","Recreation Room"]
["km000412","01","Front"]
["km000412","02","Front Porch"]
["km000412","03","Backyard"]
["km000412","04","Backyard"]
["km000412","05","Backyard"]
["km000412","06","Backyard"]
["km000412","07","Ravine"]
["km000412","08","Foyer"]
["km000412","09","Living Room"]
["km000412","10","Living Room & Dining Room"]
["km000412","11","Living Room"]
["km000412","12","Dining Room"]
["km000412","13","Kitchen"]
["km000412","14","Kitchen"]
["km000412","15","Kitchen"]
["km000412","16","Kitchen"]
["km000412","17","Master Bedroom"]
["km000412","18","3 Piece Ensuite Bathroom"]
["km000412","19","Bedroom"]
["km000412","20","Bedroom"]
["km000412","21","5 Piece Bathroom"]
["km000412","22","Recreation Room"]
["km000412","23","Recreation Room"]
["km000412","24","Recreation Room"]
["km000412","25","Lower Level Bedroom"]
["km000412","26","3 Piece Bathroom"]
["km000411","01","Front"]
["km000411","02","Backyard"]
["km000411","03","Living Room"]
["km000411","04","Family Room"]
["km000411","05","Family Room"]
["km000411","06","Dining Room"]
["km000411","07","Kitchen"]
["km000411","08","Breakfast Area"]
["km000411","09","Master Bedroom"]
["km000411","10","5 Piece Ensuite Bathroom"]
["km000411","11","Bedroom"]
["km000411","12","4 Piece Bathroom"]
["km000411","13","Bedroom"]
["km000411","14","Recreation Room"]
["km000411","15","Recreation Room"]
["km000411","16","Nanny Suite"]
["km000411","17","3 Piece Ensuite Bathroom"]
["km000411","18","Laundry Room"]
["km000414","01","Front"]
["km000414","02","Back"]
["km000414","03","Living Room"]
["km000414","04","Living Room"]
["km000414","05","Dining Room"]
["km000414","06","Kitchen"]
["km000414","07","Master Bedroom"]
["km000414","08","Bedroom"]
["km000414","09","Bathroom"]
["km000414","10","Recreation Room"]
["km000414","11","Recreation Room"]
["km000414","12","Basement Bedroom"]
["km000414","13","Basement Bedroom"]
["km000416","01","Front"]
["km000416","02","Backyard"]
["km000416","03","Backyard"]
["km000416","04","Backyard"]
["km000416","05","Backyard"]
["km000416","06","Living Room"]
["km000416","07","Living Room"]
["km000416","08","Dining Room"]
["km000416","09","Living/Dining Room"]
["km000416","10","Kitchen"]
["km000416","11","Kitchen"]
["km000416","12","Solarium"]
["km000416","13","2 Piece Bathroom"]
["km000416","14","Master Bedroom"]
["km000416","15","Bedroom"]
["km000416","16","Bedroom"]
["km000416","17","Bedroom"]
["km000416","18","4 Piece Bathroom"]
["km000416","19","Recreation Room"]
["km000416","20","Basement Bedroom"]
["km000417","01","Front"]
["km000417","02","Backyard"]
["km000417","03","Backyard"]
["km000417","04","Backyard"]
["km000417","05","Living Room"]
["km000417","06","Living Room"]
["km000417","07","Living Room"]
["km000417","08","Kitchen"]
["km000417","09","Kitchen"]
["km000417","10","Kitchen"]
["km000417","11","Dining Room"]
["km000417","12","Master Bedroom"]
["km000417","13","Bedroom"]
["km000417","14","Bedroom"]
["km000417","15","4 Piece Bathroom"]
["km000417","16","Recreation Room"]
["km000417","17","Recreation Room"]
["km000417","18","Recreation Room"]
["km000417","19","Lower Level Kitchen"]
["km000417","20","Lower Level Bedroom"]
["km000417","21","3 Piece Bathroom"]
["km000418","01","Front"]
["km000418","02","Side Yard"]
["km000418","03","Side Yard"]
["km000418","04","Backyard"]
["km000418","05","Living Room"]
["km000418","06","Living Room"]
["km000418","07","Kitchen"]
["km000418","08","Kitchen"]
["km000418","09","Dining Room"]
["km000418","10","Office"]
["km000418","11","Master Bedroom"]
["km000418","12","Ensuite 2 Piece Bathroom"]
["km000418","13","Bedroom"]
["km000418","14","Bedrom"]
["km000418","15","4 Piece Bathroom"]
["km000418","16","Recreation Room"]
["km000418","17","Lower Level 4 Piece Bathroom"]
["km000418","18","Lower Level Bedroom"]
["km000418","19","Lower Level Bedroom"]
["km000418","20","Lower Level Bedroom"]
["km000282","01","Front"]
["km000282","02","Backyard"]
["km000282","03","Backyard"]
["km000282","04","Backyard"]
["km000282","05","Green Space"]
["km000282","06","Living Room"]
["km000282","07","Living Room"]
["km000282","08","Dining Room"]
["km000282","09","Kitchen"]
["km000282","10","Breakfast Area"]
["km000282","11","2 Piece Bathroom"]
["km000282","12","Family Room"]
["km000282","13","Master Bedroom"]
["km000282","14","Bedroom"]
["km000282","15","4 Piece Bathroom"]
["km000282","16","Recreation Room"]
["km000282","17","Recreation Room"]
["km000282","18","Lower Level Bedroom"]
["km000419","01","Front"]
["km000419","02","Living/Dining Rom"]
["km000419","03","Living Room"]
["km000419","04","Living/Dining Room"]
["km000419","05","Kitchen"]
["km000419","06","Master Bedroom"]
["km000419","07","Bedroom"]
["km000419","08","Bathroom"]
["km000419","09","Terrace"]
["km000419","10","Terrace"]
["km000420","01","Front"]
["km000420","02","Front"]
["km000420","03","Side Yard"]
["km000420","04","Backyard"]
["km000420","05","Foyer"]
["km000420","06","Living Room"]
["km000420","07","Living Room"]
["km000420","08","Kitchen"]
["km000420","09","Dining Room"]
["km000420","10","Dining Room"]
["km000420","11","Family Room"]
["km000420","12","Family Room"]
["km000420","13","Family Room"]
["km000420","14","Master Bedroom"]
["km000420","15","4 Piece Ensuite Bathroom"]
["km000420","16","4 Piece Ensuite Bathroom"]
["km000420","17","4 Piece Ensuite Bathroom"]
["km000420","18","Office/Bedroom"]
["km000420","19","Bedroom"]
["km000420","20","Bedroom"]
["km000420","21","Bedroom"]
["km000420","22","4 Piece Bathroom"]
["km000420","23","Recreation Room"]
["km000420","24","Recreation Room"]
["km000420","25","Recreation Room"]
["km000420","26","Games Room"]
["km000420","27","Basement Bedroom"]
["km000420","28","4 Piece Bathroom"]
["km000421","01","Front"]
["km000421","02","Backyard"]
["km000421","03","Backyard"]
["km000421","04","Living Room"]
["km000421","05","Living Room"]
["km000421","06","Dining Room"]
["km000421","07","Kitchen"]
["km000421","08","Kitchen"]
["km000421","09","Master Bedroom"]
["km000421","10","Bedroom"]
["km000421","11","Bedroom"]
["km000421","12","4 Piece Bathroom"]
["km000421","13","Recreation Room"]
["km000421","14","Recreation Room"]
["km000421","15","Basement Kitchen"]
["km000421","16","Bedroom"]
["km000421","17","Bedroom"]
["km000421","18","Laundry Room"]
["km000421","19","4 Piece Bathroom"]
["km000423","01","Front"]
["km000423","02","Backyard"]
["km000423","03","Backyard"]
["km000423","04","Backyard"]
["km000423","05","Kitchen"]
["km000423","06","Living Room"]
["km000423","07","Living Room"]
["km000423","08","Living Room"]
["km000423","09","Dining Room"]
["km000423","10","Master Bedroom"]
["km000423","11","Bedroom"]
["km000423","12","Bedroom"]
["km000423","13","4 Piece Bathroom"]
["km000423","14","Recreation Room"]
["km000423","15","Recreation Room"]
["km000423","16","4 Piece Bathroom"]
["km000423","17","Office"]
["km000425","01","Front"]
["km000425","02","Backyard"]
["km000425","03","Backyard"]
["km000425","04","Backyard"]
["km000425","05","Living Room"]
["km000425","06","Living Room"]
["km000425","07","Dining Room"]
["km000425","08","Dining Room"]
["km000425","09","Kitchen"]
["km000425","10","Kitchen"]
["km000425","11","Den"]
["km000425","12","Master Bedroom"]
["km000425","13","Bedroom"]
["km000425","14","Bedroom"]
["km000425","15","Bedroom"]
["km000425","16","4 Piece Bathroom"]
["km000425","17","Recreation Room"]
["km000425","18","Wet Bar"]
["km000425","19","3 Piece Bathroom"]
["km000426","01","Front"]
["km000426","02","Backyard"]
["km000426","03","Backyard"]
["km000426","04","Backyard"]
["km000426","05","Backyard"]
["km000426","06","Living Room"]
["km000426","07","Living/Dining Room"]
["km000426","08","Dining Room"]
["km000426","09","Kitchen"]
["km000426","10","Kitchen"]
["km000426","11","Master Bedroom"]
["km000426","12","Bedroom"]
["km000426","13","4 Piece Bathroom"]
["km000426","14","Recreation Room"]
["km000426","15","Basement Bedroom"]
["km000426","16","3 Piece Bathroom"]
["km000429","01","Side Aerial"]
["km000429","02","Front"]
["km000429","03","Aerial"]
["km000429","04","Kitchen"]
["km000429","05","Living/Dining Room"]
["km000429","06","Living/Dining Room"]
["km000429","07","Dining Room"]
["km000429","08","Recreation Room"]
["km000429","09","Balcony"]
["km000429","10","Backyard"]
["km000429","11","Park"]
["km000429","12","Backyard"]
["km000429","13","Aerial"]
["km000429","14","Aerial"]
["km000427","01","Front"]
["km000427","02","Front"]
["km000427","03","Front"]
["km000427","04","Front Walkway"]
["km000427","05","Backyard"]
["km000427","06","Backyard"]
["km000427","07","Backyard"]
["km000427","08","Foyer"]
["km000427","09","Kitchen"]
["km000427","10","Dining Room"]
["km000427","11","Living Room"]
["km000427","12","Living Room"]
["km000427","13","Living Room"]
["km000427","14","Master Bedroom"]
["km000427","15","Bedroom"]
["km000427","16","Bedroom"]
["km000427","17","Bathroom"]
["km000427","18","Recreation Room"]
["km000430","01","Front"]
["km000430","02","Porch"]
["km000430","03","Backyard"]
["km000430","04","Backyard"]
["km000430","05","Living Room"]
["km000430","06","Living Room"]
["km000430","07","Living Room"]
["km000430","08","Living Room"]
["km000430","09","Living Room"]
["km000430","10","Dining Room"]
["km000430","11","Kitchen"]
["km000430","12","Kitchen"]
["km000430","13","Breakfast Area"]
["km000430","14","Master Bedroom"]
["km000430","15","Master Bedroom"]
["km000430","16","4 Piece Bathroom"]
["km000430","17","Bedroom"]
["km000430","18","Bedroom"]
["km000430","19","Recreation Room"]
["km000430","20","3 Piece Bathroom"]
["km000430","21","4th Bedroom/Office"]
["km000431","01","Front"]
["km000431","02","Living/Dining Room"]
["km000431","03","Living Room"]
["km000431","04","Dining Room"]
["km000431","05","Kitchen"]
["km000431","06","Kitchen"]
["km000431","07","Master Bedroom"]
["km000431","08","Bedroom"]
["km000431","09","4 Piece Bathroom"]
["km000431","10","Garden Terrace"]
["km000434","01","Front"]
["km000434","02","Backyard"]
["km000434","03","2 Piece Powder Room"]
["km000434","04","Living Room"]
["km000434","05","Living Room"]
["km000434","06","Dining Room"]
["km000434","07","Dining/Living Room"]
["km000434","08","Kitchen"]
["km000434","09","Family Room"]
["km000434","10","Kitchen/Family Room"]
["km000434","11","Master Bedroom"]
["km000434","12","5 Piece Ensuite Bathroom"]
["km000434","13","Walk-in Closet"]
["km000434","14","Sun Deck"]
["km000434","15","2nd Level"]
["km000434","16","Bedroom"]
["km000434","17","Bedroom"]
["km000434","18","Bedroom"]
["km000434","19","Lower Level"]
["km000435","01","Front"]
["km000435","02","Backyard"]
["km000435","03","Backyard"]
["km000435","04","Backyard"]
["km000435","05","Foyer"]
["km000435","06","Living Room"]
["km000435","07","Living Room"]
["km000435","08","Living/Dining Room"]
["km000435","09","Living Room"]
["km000435","10","Dining Room"]
["km000435","11","Kitchen"]
["km000435","12","Kitchen"]
["km000435","13","Master Bedroom"]
["km000435","14","2 Piece Ensuite Bathroom"]
["km000435","15","Bedroom"]
["km000435","16","Bedroom"]
["km000435","17","Bedroom"]
["km000435","18","4 Piece Bathroom"]
["km000435","19","Recreation Room"]
["km000436","01","Front"]
["km000436","02","Backyard"]
["km000436","03","Backyard"]
["km000436","04","Backyard"]
["km000436","05","Kitchen"]
["km000436","06","Kitchen"]
["km000436","07","Dining Room"]
["km000436","08","Living Room"]
["km000436","09","Living Room"]
["km000436","10","Living Room"]
["km000436","11","Bedroom"]
["km000436","12","Bedroom"]
["km000436","13","Bedroom"]
["km000436","14","Bathroom"]
["km000436","15","Recreation Room"]
["km000437","01","Front"]
["km000437","02","Backyard"]
["km000437","03","Aerial"]
["km000437","04","Breakfast Area"]
["km000437","05","Kitchen"]
["km000437","06","Kitchen"]
["km000437","07","Living Room"]
["km000437","08","Family Room"]
["km000437","09","Dining Room"]
["km000440","01","Front"]
["km000440","02","Front Exterior"]
["km000440","03","Backyard"]
["km000440","04","Backyard"]
["km000440","05","Backyard"]
["km000440","06","Backyard"]
["km000440","07","Living Room"]
["km000440","08","Living Room"]
["km000440","09","Living/Dining Room"]
["km000440","10","Dining Room"]
["km000440","11","Kitchen"]
["km000440","12","Kitchen"]
["km000440","13","Kitchen"]
["km000440","14","Kitchen"]
["km000440","15","Family Room"]
["km000440","16","Family Room"]
["km000440","17","Master Bedroom"]
["km000440","18","4 Piece Ensuite Bathroom"]
["km000440","19","Bedroom"]
["km000440","20","Bedroom"]
["km000440","21","4 Piece Bathroom"]
["km000440","22","Recreation Room"]
["km000440","23","Recreation Room"]
["km000439","01","Front"]
["km000439","02","Front Exterior"]
["km000439","03","Backyard"]
["km000439","04","Backyard"]
["km000439","05","Living Room"]
["km000439","06","Living Room"]
["km000439","07","Living Room"]
["km000439","08","Dining Room"]
["km000439","09","Den"]
["km000439","10","Kitchen"]
["km000439","11","Kitchen"]
["km000439","12","Master Bedroom"]
["km000439","13","Bedroom"]
["km000439","14","Bedroom"]
["km000439","15","4 Piece Bathroom"]
["km000439","16","Recreation Room"]
["km000439","17","Recreation Room"]
["km000442","01","Front"]
["km000442","02","Backyard"]
["km000442","03","Backyard"]
["km000442","04","Backyard"]
["km000442","05","Backyard"]
["km000442","06","Foyer"]
["km000442","07","Living Room"]
["km000442","08","Living/Dining Room"]
["km000442","09","Den"]
["km000442","10","Dining Room"]
["km000442","11","Kitchen"]
["km000442","12","Kitchen"]
["km000442","13","Family Room"]
["km000442","14","Master Bedroom"]
["km000442","15","4 Piece Ensuite Bathroom"]
["km000442","16","Bedroom"]
["km000442","17","2 Piece Ensuite Bathroom"]
["km000442","18","Mud Room"]
["km000442","19","Lower Level Family Room"]
["km000442","20","Lower Level 3 Piece Bathroom"]
["km000442","21","Lower Level Bedroom"]
["km000442","22","Lower Level Bedroom"]
["km000441","01","Front"]
["km000441","02","Front Porch"]
["km000441","03","Backyard"]
["km000441","04","Kitchen"]
["km000441","05","Kitchen"]
["km000441","06","Kitchen"]
["km000441","07","Dining Room"]
["km000441","08","Dining Room"]
["km000441","09","Living Room"]
["km000441","10","Living Room"]
["km000441","11","Family Room"]
["km000441","12","Family Room"]
["km000441","13","Bedroom"]
["km000441","14","4 Piece Bathroom"]
["km000441","15","Bedroom"]
["km000441","16","4 Piece Ensuite Bathroom"]
["km000441","17","Bedroom"]
["km000441","18","3 Piece Ensuite Bathroom"]
["km000441","19","Laundry Room"]
["km000441","20","2 Piece Bathroom"]
["km000447","01","Front"]
["km000447","02","Backyard"]
["km000447","03","Backyard"]
["km000447","04","Living Room"]
["km000447","05","Living Room"]
["km000447","06","Dining Room"]
["km000447","07","Kitchen"]
["km000447","08","Breakfast Area"]
["km000447","09","Den"]
["km000447","10","Master Bedroom"]
["km000447","11","Master Bedroom 3 Piece Ensuite"]
["km000447","12","Bedroom"]
["km000447","13","4 Piece Bathroom"]
["km000447","14","Bedroom"]
["km000447","15","Bedroom"]
["km000447","16","Office"]
["km000447","17","3 Piece Bathroom"]
["km000447","18","Recreation Room"]
["km000446","01","Front"]
["km000446","02","Backyard"]
["km000446","03","Backyard"]
["km000446","04","Living Room"]
["km000446","05","Living Room"]
["km000446","06","Living Room"]
["km000446","07","Dining Room"]
["km000446","08","Kitchen"]
["km000446","09","Kitchen"]
["km000446","10","Family Room"]
["km000446","11","2 Piece Powder Room"]
["km000446","12","Bedroom"]
["km000446","13","Bedroom"]
["km000446","14","Bedroom"]
["km000446","15","3 Piece Bathroom"]
["km000446","16","Office/Sunroom"]
["km000446","17","Master Bedroom"]
["km000446","18","Master Bedroom"]
["km000446","19","3 Piece Ensuite Bathroom"]
["km000446","20","Lower Level Apartment"]
["km000445","01","Front"]
["km000445","02","Backyard"]
["km000445","03","Backyard"]
["km000445","04","Backyard"]
["km000445","05","Foyer"]
["km000445","06","Living Room"]
["km000445","07","Library"]
["km000445","08","Dining Room"]
["km000445","09","Kitchen"]
["km000445","10","Kitchen"]
["km000445","11","Kitchen"]
["km000445","12","Kitchen"]
["km000445","13","Kitchen"]
["km000445","14","Kitchen"]
["km000445","15","Family Room"]
["km000445","16","Family Room"]
["km000445","17","Laundry Room"]
["km000445","18","2 Piece Powder Room"]
["km000445","19","Upper Landing"]
["km000445","20","Master Bedroom"]
["km000445","21","5 Piece Ensuite Bathroom"]
["km000445","22","Bedroom"]
["km000445","23","Bedroom"]
["km000445","24","Bedroom"]
["km000445","25","4 Piece Bathroom"]
["km000445","26","Lower Level Landing"]
["km000445","27","Recreation Room"]
["km000445","28","Recreation Room"]
["km000445","29","3 Piece Bathroom"]
["km000445","30","Bedroom"]
["km000445","31","Office/Bedroom"]
["km000445","32","Stairs"]
["km000438","01","Front"]
["km000438","02","Sideyard"]
["km000438","03","Kitchen"]
["km000438","04","Living Room"]
["km000438","05","Living/Dining Room"]
["km000438","06","Dining Room"]
["km000438","07","Master Bedroom"]
["km000438","08","Bedroom"]
["km000438","09","4 Piece Bathroom"]
["km000438","10","Lower Level Bedroom"]
["km000438","11","Lower Level Bedroom"]
["km000438","12","Lower Level 4 Piece Bathroom"]
["km000438","13","Basement"]
["km000438","14","Basement"]
["km000451","01","Front"]
["km000451","02","Balcony View"]
["km000451","03","Kitchen"]
["km000451","04","Kitchen"]
["km000451","05","Kitchen"]
["km000451","06","Living Room"]
["km000451","07","Dining Room"]
["km000451","08","Kitchen/Living/Dining Room"]
["km000451","09","Kitchen/Living/Dining Room"]
["km000451","10","Master Bedroom"]
["km000451","11","Master Bedroom"]
["km000451","12","3 Piece Ensuite Bathroom"]
["km000451","13","Bedroom"]
["km000451","14","4 Piece Ensuite Bathroom"]
["km000451","15","2 Piece Bathroom"]
["km000451","16","Indoor Pool"]
["km000448","01","Front"]
["km000448","02","Backyard"]
["km000448","03","Backyard"]
["km000448","04","Backyard"]
["km000448","05","Backyard"]
["km000448","06","Foyer"]
["km000448","07","Living Room"]
["km000448","08","Living Room"]
["km000448","09","Living Room"]
["km000448","10","Dining Room"]
["km000448","11","Kitchen"]
["km000448","12","Kitchen"]
["km000448","13","Kitchen"]
["km000448","14","Kitchen/Dining Room"]
["km000448","15","Kitchen/Dining Room"]
["km000448","16","Master Bedroom"]
["km000448","17","Master Bedroom"]
["km000448","18","Master Bedroom"]
["km000448","19","Dressing Room"]
["km000448","20","Dressing Room"]
["km000448","21","3 Piece Ensuite Bathroom"]
["km000448","22","3 Piece Ensuite Bathroom"]
["km000448","23","Powder Room"]
["km000448","24","Office"]
["km000448","25","Recreation Room"]
["km000448","26","Recreation Room"]
["km000448","27","Recreation Room"]
["km000448","28","Den"]
["km000448","29","Lower Level Bedrom"]
["km000448","30","Lower Level Bedrom"]
["km000448","31","4 Piece Bathroom"]
["km000448","32","Laundry Room"]
["km000458","01","Front"]
["km000458","02","Backyard"]
["km000458","03","Backyard"]
["km000458","04","Backyard"]
["km000458","05","Backyard"]
["km000458","06","Foyer"]
["km000458","07","Living Room"]
["km000458","08","Living Room"]
["km000458","09","Dining Room"]
["km000458","10","Kitchen"]
["km000458","11","Kitchen"]
["km000458","12","Master Bedroom"]
["km000458","13","Bedroom"]
["km000458","14","Bedroom"]
["km000458","15","Recreation Room"]
["km000458","16","Recreation Room"]
["km000458","17","Recreation Room"]
["km000458","18","Lower Level Bathroom"]
["km000459","01","Front"]
["km000459","02","Backyard"]
["km000459","03","Backyard"]
["km000459","04","Backyard"]
["km000459","05","Backyard"]
["km000459","06","Living Room"]
["km000459","07","Living Room"]
["km000459","08","Living Room"]
["km000459","09","Dining Room"]
["km000459","10","Kitchen"]
["km000459","11","Kitchen"]
["km000459","12","Office"]
["km000459","13","2 Piece Powder Room"]
["km000459","14","Master Bedroom"]
["km000459","15","Master Bedroom"]
["km000459","16","3 Piece Ensuite Bathroom"]
["km000459","17","Bedroom"]
["km000459","18","Bedroom"]
["km000459","19","Bedroom"]
["km000459","20","5 Piece Bathroom"]
["km000459","21","Recreation Room"]
["km000459","22","Recreation Room"]
["km000459","23","Recreation Room"]
["km000462","01","Front"]
["km000462","02","Backyard"]
["km000462","03","Backyard"]
["km000462","04","Kitchen"]
["km000462","05","Breakfast Area"]
["km000462","06","Living/Dining Room"]
["km000462","07","Living Room"]
["km000462","08","Dining Room"]
["km000462","09","Dining Room"]
["km000462","10","Master Bedroom"]
["km000462","11","Bedroom"]
["km000462","12","Bedroom"]
["km000462","13","4 Piece Bathroom"]
["km000462","14","Family Room"]
["km000462","15","Recreation Room"]
["km000464","01","Front"]
["km000464","02","Backyard"]
["km000464","03","Backyard"]
["km000464","04","Kitchen"]
["km000464","05","Kitchen"]
["km000464","06","Living Room"]
["km000464","07","Living Room"]
["km000464","08","Living Room"]
["km000464","09","Dining Room"]
["km000464","10","Dining Room"]
["km000464","11","Master Bedroom"]
["km000464","12","4 Piece Bathroom"]
["km000464","13","Bedroom"]
["km000464","14","Bedroom"]
["km000464","15","Recreation Room"]
["km000466","01","Front"]
["km000466","02","Backyard"]
["km000466","03","Living Room"]
["km000466","04","Living/Dining Room"]
["km000466","05","Dining Room"]
["km000466","06","Kitchen"]
["km000466","07","Breakfast Area"]
["km000466","08","Kitchen"]
["km000466","09","Master Bedroom"]
["km000466","10","Bedroom"]
["km000466","11","4 Piece Bathroom"]
["km000466","12","2nd Level Living/Dining Room"]
["km000466","13","2nd Level Kitchen"]
["km000466","14","2nd Level Master Bedroom"]
["km000466","15","2nd Level 4 Piece Bathroom"]
["km000466","16","Lower Level Bedroom"]
["km000466","17","Lower Level Bedroom"]
["km000466","18","Lower Level 4 Piece Bathroom"]
["km000465","01","Front"]
["km000465","02","Backyard"]
["km000465","03","Backyard"]
["km000465","04","Front Porch"]
["km000465","05","Foyer"]
["km000465","06","Kitchen"]
["km000465","07","Kitchen"]
["km000465","08","Living Room"]
["km000465","09","Living Room"]
["km000465","10","Living Room"]
["km000465","11","Dining Room"]
["km000465","12","Dining Room"]
["km000465","13","Den"]
["km000465","14","Den"]
["km000465","15","Master Bedroom"]
["km000465","16","Bedroom"]
["km000465","17","Bedroom"]
["km000465","18","Office/Bedroom"]
["km000465","19","4 Piece Bathroom"]
["km000465","20","Recreation Room"]
["km000465","21","Recreation Room"]
["km000468","01","Front"]
["km000468","02","Backyard"]
["km000468","03","Backyard"]
["km000468","04","Backyard"]
["km000468","05","Backyard"]
["km000468","06","Backyard"]
["km000468","07","Foyer"]
["km000468","08","Living Room"]
["km000468","09","Living Room"]
["km000468","10","Living Room"]
["km000468","11","Dining Room"]
["km000468","12","Dining Room"]
["km000468","13","Kitchen"]
["km000468","14","Kitchen"]
["km000468","15","Kitchen"]
["km000468","16","Family Room"]
["km000468","17","Family Room"]
["km000468","18","Study"]
["km000468","19","Stairs"]
["km000468","20","Upper Landing"]
["km000468","21","Master Bedroom"]
["km000468","22","Master Bedroom Sitting Area"]
["km000468","23","Master Bedroom"]
["km000468","24","5 Piece Ensuite Bathroom"]
["km000468","25","Bedroom"]
["km000468","26","Bedroom"]
["km000468","27","Bedroom"]
["km000468","28","5 Piece Bathroom"]
["km000468","29","Recreation Room"]
["km000468","30","Recreation Room"]
["km000468","31","Recreation Room"]
["km000468","32","Lower Level 3 Piece Bathroom"]
["km000468","33","Lower Level 3 Piece Bathroom"]
["km000468","34","Lower Level Bedroom"]
["km000468","35","Lower Level"]
["km000467","01","Front"]
["km000467","02","Backyard"]
["km000467","03","Living Room"]
["km000467","04","Dining Room"]
["km000467","05","Kitchen"]
["km000467","06","Kitchen"]
["km000467","07","Family Room"]
["km000467","08","Family Room"]
["km000467","09","Bedroom"]
["km000467","10","4 Piece Bathroom"]
["km000467","11","Master Bedroom"]
["km000467","12","4 Piece Semi-Ensuite Bathroom"]
["km000469","01","Front"]
["km000469","02","Backyard"]
["km000469","03","Foyer"]
["km000469","04","Living Room"]
["km000469","05","Living Room"]
["km000469","06","Dining Room"]
["km000469","07","Living Room/Dining Room"]
["km000469","08","Kitchen"]
["km000469","09","Breakfast Area"]
["km000469","10","2 Piece Bathroom"]
["km000469","11","Family Room"]
["km000469","12","Family Room"]
["km000469","13","Master Bedroom"]
["km000469","14","2 Piece Ensuite Bathroom"]
["km000469","15","Bedroom"]
["km000469","16","4 Piece Bathroom"]
["km000469","17","Recreation Room"]
["km000470","01","Front"]
["km000470","02","Backyard"]
["km000470","03","Foyer"]
["km000470","04","Kitchen"]
["km000470","05","Kitchen"]
["km000470","06","Living Room"]
["km000470","07","Living Room"]
["km000470","08","Living/Dining Room"]
["km000470","09","Dining Room"]
["km000470","10","Master Bedroom"]
["km000470","11","4 Piece Bathroom"]
["km000470","12","Bedroom"]
["km000470","13","Bedroom"]
["km000470","14","Lower Level Kitchen"]
["km000470","15","Lower Level Bathroom"]
["km000470","16","Lower Level Bedroom"]
["km000471","01","Front"]
["km000471","02","Backyard"]
["km000471","03","Living/Dining Room"]
["km000471","04","Living Room"]
["km000471","05","Dining Room"]
["km000471","06","Kitchen"]
["km000471","07","Kitchen"]
["km000471","08","Master Bedroom"]
["km000471","09","Bedroom"]
["km000471","10","Bedroom"]
["km000471","11","4 Piece Bathroom"]
["km000471","12","Recreation Room"]
["km000471","13","Recreation Room"]
["km000471","14","Games Room"]
["km000471","15","Workshop"]
["km000472","01","Front"]
["km000472","02","Living/Dining/Kitchen Room"]
["km000472","03","Living Room"]
["km000472","04","Living/Dining/Kitchen Room"]
["km000472","05","Kitchen"]
["km000472","06","Dining Room"]
["km000472","07","Master Bedroom"]
["km000472","08","4 Piece Ensuite Bathroom"]
["km000472","09","Bedroom"]
["km000472","10","Den"]
["km000472","11","3 Piece Bathroom"]
["km000472","12","Exercise Room"]
["km000472","13","Roof Top"]
["km000473","01","Front"]
["km000473","02","Backyard"]
["km000473","03","Foyer"]
["km000473","04","Living Room"]
["km000473","05","Living Room"]
["km000473","06","Living Room"]
["km000473","07","Kitchen"]
["km000473","08","Kitchen"]
["km000473","09","Breakfast Area"]
["km000473","10","Master Bedroom"]
["km000473","11","4 Piece Ensuite Bathroom"]
["km000473","12","Bedroom"]
["km000473","13","Bedroom"]
["km000473","14","Bedroom"]
["km000473","15","4 Piece Bathroom"]
["km000473","16","Recreation Room"]
["km000473","17","2 Piece Bathroom"]
["km000474","01","Front"]
["km000474","02","Backyard"]
["km000474","03","Foyer"]
["km000474","04","Foyer"]
["km000474","05","Living Room"]
["km000474","06","Living Room"]
["km000474","07","Living Room"]
["km000474","08","Living Room"]
["km000474","09","Dining Room"]
["km000474","10","Kitchen"]
["km000474","11","Kitchen"]
["km000474","12","Breakfast Area"]
["km000474","13","Master Bedroom"]
["km000474","14","3 Piece Ensuite Bathroom"]
["km000474","15","Bedroom"]
["km000474","16","Bedroom"]
["km000474","17","4 Piece Bathroom"]
["km000474","18","2 Piece Bathroom"]
["km000474","19","Recreation Room"]
["km000475","01","Front"]
["km000475","02","Front Exterior"]
["km000475","03","Backyard"]
["km000475","04","Enclosed Porch"]
["km000475","05","Living Room"]
["km000475","06","Living Room"]
["km000475","07","Dining Room"]
["km000475","08","Kitchen"]
["km000475","09","Kitchen"]
["km000475","10","Kitchen"]
["km000475","11","Breakfast Area"]
["km000475","12","Master Bedroom"]
["km000475","13","5 Piece Bathroom"]
["km000475","14","Bedroom"]
["km000475","15","Bedroom"]
["km000475","16","Recreation Room"]
["km000475","17","Recreation Room"]
["km000475","18","Recreation Room"]
["km000475","19","Laundry/Exercise Room"]
["km000475","20","4 Piece Bathroom"]
["km000475","21","Garage Storage"]
["km000476","01","Front"]
["km000476","02","Front"]
["km000476","03","Front"]
["km000476","04","Front"]
["km000476","05","Backyard"]
["km000476","06","Backyard"]
["km000476","07","Backyard"]
["km000476","08","Backyard"]
["km000476","09","Foyer"]
["km000476","10","Family Room"]
["km000476","11","Family Room"]
["km000476","12","Dining Room"]
["km000476","13","Dining Room"]
["km000476","14","Kitchen"]
["km000476","15","Kitchen"]
["km000476","16","Kitchen"]
["km000476","17","Living Room"]
["km000476","18","Living Room"]
["km000476","19","Office"]
["km000476","20","Lower Landing"]
["km000476","21","Upper Landing"]
["km000476","22","Master Bedroom"]
["km000476","23","Master Bedroom"]
["km000476","24","4 Piece Ensuite Bathroom"]
["km000476","25","4 Piece Ensuite Bathroom"]
["km000476","26","Bedroom"]
["km000476","27","Bedroom"]
["km000476","28","Bedroom"]
["km000476","29","Bedroom"]
["km000476","30","5 Piece Bathroom"]
["km000476","31","5 Piece Bathroom"]
["km000476","32","Recreation Room"]
["km000476","33","Recreation Room"]
["km000476","34","Hobby/Storage Room"]
["km000476","35","Laundry Room"]
["km000476","36","3 Piece Bathroom"]
["km000477","01","Front"]
["km000477","02","Living/Dining Room"]
["km000477","03","Dining Room"]
["km000477","04","Living Room"]
["km000477","05","Living Room"]
["km000477","06","Living Room"]
["km000477","07","Breakfast Area"]
["km000477","08","Kitchen"]
["km000477","09","Kitchen"]
["km000477","10","Master Bedroom"]
["km000477","11","3 Piece Ensuite Bathroom"]
["km000477","12","Bedroom"]
["km000477","13","4 Piece Bathroom"]
["km000477","14","Balcony"]
["km000477","15","Balcony View"]
["km000477","16","Outdoor Swimming Pool"]
["km000477","17","Tennis Court"]
["km000478","01","Front"]
["km000478","02","Kitchen"]
["km000478","03","Kitchen"]
["km000478","04","Living Room"]
["km000478","05","Living Room"]
["km000478","06","Dining Room"]
["km000478","07","Bedroom"]
["km000478","08","Den"]
["km000478","09","4 Piece Bathroom"]
["km000478","10","Rooftop Patio"]
["km000478","11","Exercise Room"]
["km000479","01","Front"]
["km000479","02","Aerial"]
["km000479","03","Aerial"]
["km000479","04","Aerial"]
["km000479","05","Backyard"]
["km000479","06","Backyard"]
["km000479","07","Living Room"]
["km000479","08","Living Room"]
["km000479","09","Kitchen"]
["km000479","10","Master Bedroom"]
["km000479","11","4 Piece Bathroom"]
["km000479","12","Bedroom 2"]
["km000479","13","Bedroom 2"]
["km000479","14","Bedroom 3"]
["km000479","15","Recreation Room"]
["km000479","16","Recreation Room"]
["km000479","17","Recreation Room"]
["km000480","01","Front"]
["km000480","02","Backyard"]
["km000480","03","Foyer"]
["km000480","04","Living Room"]
["km000480","05","Living Room"]
["km000480","06","Living Room"]
["km000480","07","Dining Room"]
["km000480","08","Dining Room"]
["km000480","09","Kitchen"]
["km000480","10","Kitchen"]
["km000480","11","Kitchen"]
["km000480","12","Family Room"]
["km000480","13","Main Floor Laundry Room"]
["km000480","14","Master Bedroom"]
["km000480","15","5 Piece Ensuite Bathroom"]
["km000480","16","Bedroom"]
["km000480","17","Bedroom"]
["km000480","18","Bedroom"]
["km000480","19","5 Piece Main Bathroom"]
["km000480","20","Recreation Room"]
["km000480","21","Recreation Room"]
["km000481","01","Living Room"]
["km000481","02","Living Room"]
["km000481","03","Living Room"]
["km000481","04","Living Room"]
["km000481","05","Kitchen"]
["km000481","06","Master Bedroom"]
["km000481","07","Aerial of Living Room from Master Bedroom"]
["km000481","08","Office Nook"]
["km000481","09","Office Nook"]
["km000481","10","4 Piece Bathroom"]
["km000481","11","Balcony"]
["km000481","12","Rooftop Patio"]
["km000481","13","View from Rooftop Patio"]
["km000481","14","Front"]
["km000481","15","Exercise Room"]
["km000481","16","Sunset from Rooftop Patio"]
["km000482","01","Front"]
["km000482","02","Backyard"]
["km000482","03","Foyer"]
["km000482","04","Living/Dining/Kitchen"]
["km000482","05","Living Room"]
["km000482","06","Kitchen"]
["km000482","07","Kitchen"]
["km000482","08","Dining Room"]
["km000482","09","Dining Room"]
["km000482","10","Master Bedroom"]
["km000482","11","Bedroom"]
["km000482","12","Bedroom"]
["km000482","13","4 Piece Bathroom"]
["km000482","14","Recreation Room"]
["km000482","15","Recreation Room"]
["km000482","16","Exercise Room"]
["km000482","17","Laundry Room"]
["km000483","01","Front"]
["km000483","02","Backyard"]
["km000483","03","Backyard"]
["km000483","04","Backyard"]
["km000483","05","Living Room"]
["km000483","06","Living Room"]
["km000483","07","Living Room"]
["km000483","08","Living Room"]
["km000483","09","Dining Room"]
["km000483","10","Kitchen"]
["km000483","11","Kitchen"]
["km000483","12","Master Bedroom"]
["km000483","13","Bedroom"]
["km000483","14","Bedroom"]
["km000483","15","4 Piece Bathroom"]
["km000483","16","Recreation Room"]
["km000483","17","Recreation Room"]
["km000483","18","Recreation Room"]
["km000483","19","Workshop/Utility Room"]
["km000483","20","Lower Level Bedroom/Office"]
["km000483","21","Laundry Room"]
["km000483","22","3 Piece Bathroom"]
["km000484","01","Front"]
["km000484","02","Front Porch"]
["km000484","03","Backyard"]
["km000484","04","Backyard"]
["km000484","05","Living Room"]
["km000484","06","Living Room"]
["km000484","07","Living Room"]
["km000484","08","Dining Room"]
["km000484","09","Living & Dining Room"]
["km000484","10","Kitchen"]
["km000484","11","Kitchen"]
["km000484","12","Family Room"]
["km000484","13","Family Room"]
["km000484","14","Master Bedroom"]
["km000484","15","Bedroom"]
["km000484","16","Bedroom"]
["km000484","17","4 Piece Bathroom"]
["km000484","18","Office/Bedroom"]
["km000484","19","3 Piece Bathroom"]
["km000484","20","Recreation Room"]
["km000484","21","2 Piece Bathroom"]
["km000486","01","Front"]
["km000486","02","Backyard"]
["km000486","03","Backyard"]
["km000486","04","Foyer"]
["km000486","05","Living Room"]
["km000486","06","Living Room"]
["km000486","07","Living Room"]
["km000486","08","Dining Room"]
["km000486","09","Dining Room"]
["km000486","10","Kitchen"]
["km000486","11","Kitchen"]
["km000486","12","Breakfast Area"]
["km000486","13","Family Room"]
["km000486","14","Master Bedroom"]
["km000486","15","Bedroom"]
["km000486","16","Bedroom"]
["km000486","17","Bedroom"]
["km000486","18","4 Piece Bathroom"]
["km000486","19","Recreation Room"]
["km000486","20","Games Room"]
["km000486","21","Workshop"]
["km000486","22","Laundry/Utility Room"]
["km000488","01","Front"]
["km000488","02","Backyard"]
["km000488","03","Backyard"]
["km000488","04","Backyard"]
["km000488","05","Living Room"]
["km000488","06","Living Room"]
["km000488","07","Living/Dining Room"]
["km000488","08","Dining Room"]
["km000488","09","Kitchen"]
["km000488","10","Kitchen"]
["km000488","11","Breakfast Area"]
["km000488","12","Master Bedroom"]
["km000488","13","Bedroom"]
["km000488","14","Bedroom"]
["km000488","15","4 Piece Bathroom"]
["km000488","16","Recreation Room"]
["km000488","17","Recreation Room"]
["km000488","18","Kitchenette"]
["km000488","19","3 Piece Bathroom"]
["km000485","01","Front"]
["km000485","02","Backyard"]
["km000485","03","Living Room"]
["km000485","04","Living Room"]
["km000485","05","Dining Room"]
["km000485","06","Living/Dining Room"]
["km000485","07","Kitchen"]
["km000485","08","Kitchen"]
["km000485","09","Master Bedroom"]
["km000485","10","Bedroom"]
["km000485","11","Bedroom"]
["km000485","12","4 Piece Bathroom"]
["km000485","13","Family Room"]
["km000485","14","Bedroom"]
["km000485","15","Bedroom"]
["km000485","16","3 Piece Bathroom"]
["km000490","01","Front"]
["km000490","02","Backyard"]
["km000490","03","Backyard"]
["km000490","04","Foyer"]
["km000490","05","Living Room"]
["km000490","06","Living Room"]
["km000490","07","Dining Room"]
["km000490","08","Kitchen"]
["km000490","09","Breakfast Area"]
["km000490","10","Family Room"]
["km000490","11","Master Bedroom"]
["km000490","12","4 Piece Master Ensuite"]
["km000490","13","Sitting Room"]
["km000490","14","Bedroom"]
["km000490","15","Bedroom"]
["km000490","16","Bedroom"]
["km000490","17","4 Piece Bathroom"]
["km000490","18","Recreation Room"]
["km000490","19","Recreation Room"]
["km000490","20","Lower Level Bedroom"]
["km000490","21","Media Room"]
["km000490","22","3 Piece Bathroom + Sauna"]
["km000490","23","Laundry Room"]
["km000490","24","2 Piece Powder Room"]
["km000491","01","Front"]
["km000491","02","Living Room"]
["km000491","03","Dining Room"]
["km000491","04","Kitchen"]
["km000491","05","Living/Dining/Kitchen"]
["km000491","06","Living/Dining/Kitchen"]
["km000491","07","Master Bedroom"]
["km000491","08","4 Piece Bathroom"]
["km000491","09","Courtyard"]
["km000491","10","Balcony"]
["km000491","11","Exercise Room 1"]
["km000491","12","Exercise Room 2"]
["km000491","13","Theatre Room"]
["km000487","01","Front"]
["km000487","02","Backyard"]
["km000487","03","Backyard"]
["km000487","04","Living Room"]
["km000487","05","Living Room"]
["km000487","06","Living/Dining Room"]
["km000487","07","Dining Room"]
["km000487","08","Kitchen"]
["km000487","09","Breakfast Area"]
["km000487","10","Breakfast Area/Kitchen"]
["km000487","11","Breakfast Area/Kitchen"]
["km000487","12","Master Bedroom"]
["km000487","13","Master Bedroom Sitting Area"]
["km000487","14","Bedroom"]
["km000487","15","4 Piece Bathroom"]
["km000487","16","Lower Level Bedroom"]
["km000487","17","Recreation Room"]
["km000487","18","Laundry Room"]
["km000487","19","2 Piece Powder Room"]
["km000489","01","Front"]
["km000489","02","Front Exterior"]
["km000489","03","Backyard"]
["km000489","04","Backyard"]
["km000489","05","Living Room"]
["km000489","06","Living Room"]
["km000489","07","Living Room"]
["km000489","08","Living/Dining Room"]
["km000489","09","Dining Room"]
["km000489","10","Dining Room"]
["km000489","11","Kitchen"]
["km000489","12","Kitchen"]
["km000489","13","Morning Room"]
["km000489","14","Family Room"]
["km000489","15","Family Room"]
["km000489","16","Library"]
["km000489","17","2 Piece Powder Room"]
["km000489","18","Mud Room"]
["km000489","19","Staircase"]
["km000489","20","Master Bedroom"]
["km000489","21","Master Bedroom"]
["km000489","22","Master Bedroom Sitting Area"]
["km000489","23","Master Bedroom 5 Piece Ensuite Bathroom"]
["km000489","24","5 Piece Ensuite Bathroom"]
["km000489","25","Guest Bedroom"]
["km000489","26","4 Piece Ensuite Bathroom"]
["km000489","27","Bedroom"]
["km000489","28","3 Piece Ensuite Bathroom"]
["km000489","29","Laundry Room"]
["km000489","30","Bedroom"]
["km000489","31","4 Piece Ensuite Bathroom"]
["km000489","32","Bedroom"]
["km000489","33","3 Piece Ensuite Bathroom"]
["km000489","34","Recreation Room"]
["km000489","35","Recreation Room"]
["km000489","36","Media Room"]
["km000489","37","Wine Cellar"]
["km000489","38","Exercise Room"]
["km000489","39","Nanny's Room"]
["km000489","40","3 Piece Ensuite Bathroom"]
["km000489","41","Backyard"]
["km000492","01","Front"]
["km000492","02","Front at Night"]
["km000492","03","Front Exterior"]
["km000492","04","Backyard"]
["km000492","05","Backyard at Night"]
["km000492","06","Foyer"]
["km000492","07","Kitchen"]
["km000492","08","Kitchen"]
["km000492","09","Breakfast Area"]
["km000492","10","Dining Room"]
["km000492","11","Living Room"]
["km000492","12","Living/Dining Room"]
["km000492","13","Master Bedroom"]
["km000492","14","Bedroom"]
["km000492","15","Bedroom"]
["km000492","16","5 Piece Bathroom"]
["km000492","17","Family Room"]
["km000492","18","Family Room"]
["km000492","19","Family Room"]
["km000492","20","Office/Bedroom"]
["km000492","21","3 Piece Bathroom"]
["km000492","22","Recreation Room"]
["km000492","23","Recreation Room"]
["km000492","24","Side Yard"]
["km000493","01","Front"]
["km000493","02","Backyard"]
["km000493","03","Backyard"]
["km000493","04","Foyer"]
["km000493","05","Living Room"]
["km000493","06","Living/Dining Room"]
["km000493","07","Dining Room"]
["km000493","08","Kitchen"]
["km000493","09","Kitchen"]
["km000493","10","Kitchen"]
["km000493","11","Kitchen"]
["km000493","12","Breakfast Solarium"]
["km000493","13","Breakfast Solarium"]
["km000493","14","Family Room"]
["km000493","15","Master Bedroom"]
["km000493","16","Master Bedroom 3 Piece Ensuite Bathroom"]
["km000493","17","Bedroom"]
["km000493","18","Bedroom"]
["km000493","19","4 Piece Bathroom"]
["km000493","20","Recreation Room"]
["km000493","21","Recreation Room"]
["km000493","22","Workshop"]
["km000493","23","2 Piece Bathroom"]
["km000494","01","Front"]
["km000494","02","Front Garden & Porch"]
["km000494","03","Front Garden & Porch"]
["km000494","04","Backyard"]
["km000494","05","Backyard"]
["km000494","06","Dining Room"]
["km000494","07","Dining Room"]
["km000494","08","Kitchen"]
["km000494","09","Kitchen"]
["km000494","10","Kitchen"]
["km000494","11","Master Bedroom"]
["km000494","12","Bedroom"]
["km000494","13","4 Piece Bathroom"]
["km000494","14","Living Room Aerial View"]
["km000494","15","Living Room"]
["km000494","16","Living Room"]
["km000494","17","2 Piece Bathroom"]
["km000496","01","Front"]
["km000496","02","Backyard"]
["km000496","03","Backyard"]
["km000496","04","Backyard"]
["km000496","05","Foyer"]
["km000496","06","Living Room"]
["km000496","07","Living/Dining Room"]
["km000496","08","Dining Room"]
["km000496","09","Kitchen"]
["km000496","10","Kitchen"]
["km000496","11","Breakfast Area"]
["km000496","12","Master Bedroom"]
["km000496","13","4 Piece Bathroom"]
["km000496","14","Bedroom"]
["km000496","15","Bedroom"]
["km000496","16","Recreation Room"]
["km000496","17","Recreation Room"]
["km000496","18","Recreation Room"]
["km000496","19","Recreation Room"]
["km000496","20","Lower Level Bedroom"]
["km000496","21","Workshop"]
["km000496","22","2 Piece Bathroom"]
["km000496","23","Laundry/Utility Room"]
["km000497","01","Front"]
["km000497","02","Backyard"]
["km000497","03","Backyard"]
["km000497","04","Backyard"]
["km000497","05","Living Room"]
["km000497","06","Living Room"]
["km000497","07","Living Room"]
["km000497","08","Dining Room"]
["km000497","09","Dining Room"]
["km000497","10","Kitchen"]
["km000497","11","Kitchen"]
["km000497","12","Kitchen"]
["km000497","13","Master Bedroom"]
["km000497","14","Bedroom"]
["km000497","15","Bedroom"]
["km000497","16","4 Piece Bathroom"]
["km000497","17","Recreation Room"]
["km000497","18","Recreation Room"]
["km000497","19","Recreation Room"]
["km000497","20","Recreation Room"]
["km000497","21","Laundry Room"]
["km000497","22","3 Piece Bathroom"]
["km000498","01","Front"]
["km000498","02","Front"]
["km000498","03","Front Exterior"]
["km000498","04","Front Exterior"]
["km000498","05","Front Exterior"]
["km000498","06","Backyard"]
["km000498","07","Backyard"]
["km000498","08","Backyard"]
["km000498","09","Backyard"]
["km000498","10","Backyard"]
["km000498","11","Backyard"]
["km000498","12","Backyard"]
["km000498","13","Backyard at Night"]
["km000498","14","Backyard at Night"]
["km000498","15","Foyer"]
["km000498","16","Dining Room"]
["km000498","17","Dining Room"]
["km000498","18","Dining Room"]
["km000498","19","Dining Room"]
["km000498","20","Sitting Room"]
["km000498","21","Sitting Room"]
["km000498","22","Kitchen"]
["km000498","23","Kitchen"]
["km000498","24","Kitchen"]
["km000498","25","Breakfast Area"]
["km000498","26","Breakfast Area"]
["km000498","27","Breakfast Area"]
["km000498","28","Great Room"]
["km000498","29","Great Room"]
["km000498","30","Great Room"]
["km000498","31","Great Room"]
["km000498","32","Great Room"]
["km000498","33","Master Bedroom"]
["km000498","34","Master Bedroom"]
["km000498","35","Master Bedroom"]
["km000498","36","Master Bedroom 4 Piece Ensuite Bathroom"]
["km000498","37","Bedroom"]
["km000498","38","Bedroom"]
["km000498","39","Bedroom"]
["km000498","40","4 Piece Main Bathroom"]
["km000498","41","Recreation Room"]
["km000498","42","Recreation Room"]
["km000498","43","Lower Level Bedroom"]
["km000498","44","Lower Level Bedroom"]
["km000498","45","Lower Level 4 Piece Bathroom"]
["km000499","01","Front"]
["km000499","02","Front Exterior"]
["km000499","03","Backyard"]
["km000499","04","Backyard"]
["km000499","05","Foyer"]
["km000499","06","Foyer"]
["km000499","07","Main Level Landing"]
["km000499","08","Main Level Landing"]
["km000499","09","Living Room"]
["km000499","10","Living Room"]
["km000499","11","Dining Room"]
["km000499","12","Dining Room"]
["km000499","13","Kitchen"]
["km000499","14","Kitchen"]
["km000499","15","Kitchen"]
["km000499","16","Kitchen"]
["km000499","17","Kitchen"]
["km000499","18","Breakfast Area"]
["km000499","19","Breakfast Area & Family Room"]
["km000499","20","Family Room"]
["km000499","21","Family Room"]
["km000499","22","Office"]
["km000499","23","2 Piece Powder Room"]
["km000499","24","Upper Landing"]
["km000499","25","Master Bedroom"]
["km000499","26","Master Bedroom"]
["km000499","27","Master Bedroom 6 Piece Ensuite Bathroom"]
["km000499","28","Master Bedroom 6 Piece Ensuite Bathroom"]
["km000499","29","Bedroom"]
["km000499","30","4 Piece Enusite Bathroom"]
["km000499","31","Bedroom"]
["km000499","32","5 Piece Semi-Ensuite Bathroom"]
["km000499","33","Bedroom"]
["km000499","34","Laundry Room"]
["km000499","35","Recreaion Room"]
["km000499","36","Recreaion Room"]
["km000499","37","Lower Level Bedroom"]
["km000499","38","Lower Level Bedroom"]
["km000499","39","Lower Level 4 Piece Bathroom"]
["km000500","01","Front "]
["km000500","02","Side Yard"]
["km000500","03","Backyard"]
["km000500","04","Backyard"]
["km000500","05","Ravine"]
["km000500","06","Living Room"]
["km000500","07","Living Room"]
["km000500","08","Living/Dining Room"]
["km000500","09","Living/Dining Room"]
["km000500","10","Dining Room"]
["km000500","11","Kitchen"]
["km000500","12","Kitchen"]
["km000500","13","Master Bedroom"]
["km000500","14","Master Bedroom"]
["km000500","15","Bedroom"]
["km000500","16","4 Piece Bathroom"]
["km000500","17","Lower Level Family Room"]
["km000500","18","Lower Level Family Room"]
["km000500","19","Lower Level Bedroom"]
["km000500","20","Lower Level Bathroom"]
["km000495","01","Front"]
["km000495","02","Front Exterior"]
["km000495","03","Front Exterior"]
["km000495","04","Backyard"]
["km000495","05","Backyard"]
["km000495","06","Backyard"]
["km000495","07","Backyard"]
["km000495","08","Backyard"]
["km000495","09","Backyard"]
["km000495","10","Foyer"]
["km000495","11","Foyer"]
["km000495","12","Family Room"]
["km000495","13","Family Room"]
["km000495","14","Living Room"]
["km000495","15","Living Room"]
["km000495","16","Dining Room"]
["km000495","17","Dining Room"]
["km000495","18","Kitchen"]
["km000495","19","Kitchen"]
["km000495","20","Kitchen"]
["km000495","21","Kitchen"]
["km000495","22","Breakfast Area"]
["km000495","23","Breakfast Area"]
["km000495","24","Laundry Room"]
["km000495","25","2 Piece Bathroom"]
["km000495","26","Master Bedroom"]
["km000495","27","Master Bedroom"]
["km000495","28","Master Bedroom Dressing Room"]
["km000495","29","Master Bedroom Dressing Room"]
["km000495","30","6 Piece Ensuite Bathroom"]
["km000495","31","6 Piece Ensuite Bathroom"]
["km000495","32","Bedroom"]
["km000495","33","Bedroom"]
["km000495","34","Bedroom"]
["km000495","35","3 Piece Bathroom"]
["km000495","36","Upper Level Landing"]
["km000495","37","Lower Level Foyer"]
["km000495","38","Lower Level Foyer"]
["km000495","39","Storage Room"]
["km000495","40","Recreation Room"]
["km000495","41","Recreation Room"]
["km000495","42","3 Piece Bathroom"]
["km000495","43","Front Exterior"]
["km000495","44","Front Exterior"]
["km000495","45","Front Exterior"]
["km000495","46","Front Exterior"]
["km000495","47","Front Exterior"]
["km000495","48","Front Exterior"]
["km000495","49","Front Exterior"]
["km000495","50","Backyard in Autumn"]
["km000495","51","Front Exterior in Autumn"]
["km000495","52","Backyard"]
["km000501","01","Front"]
["km000501","02","Backyard"]
["km000501","03","Backyard"]
["km000501","04","Backyard"]
["km000501","05","Kitchen"]
["km000501","06","Kitchen"]
["km000501","07","Kitchen"]
["km000501","08","Living Room"]
["km000501","09","Living Room"]
["km000501","10","Living Room"]
["km000501","11","Dining Room"]
["km000501","12","Dining Room"]
["km000501","13","Master Bedroom"]
["km000501","14","Bedroom"]
["km000501","15","Bedroom"]
["km000501","16","Recreation Room"]
["km000501","17","4 Piece Bathroom"]
["km000502","01","Front"]
["km000502","02","Front"]
["km000502","03","Front"]
["km000502","04","Front"]
["km000502","05","Side Yard"]
["km000502","06","Foyer"]
["km000502","07","Living Room"]
["km000502","08","Living/Dining Room "]
["km000502","09","Kitchen"]
["km000502","10","Kitchen"]
["km000502","11","Master Bedroom"]
["km000502","12","Bedroom"]
["km000502","13","Bedroom"]
["km000502","14","4 Piece Bathroom"]
["km000502","15","Recreation Room"]
["km000502","16","Recreation Room"]
["km000502","17","Games Room"]
["km000502","18","Games Room"]
["km000502","19","Solarium"]
["km000502","20","Lower Level Bedroom"]
["km000502","21","Lower Level 4 Piece Bathroom"]
["km000502","22","Side Yard"]
["km000505","01","Front "]
["km000505","02","Living Room"]
["km000505","03","Living Room"]
["km000505","04","Kitchen"]
["km000505","05","Living Room/Kitchen"]
["km000505","06","Kitchen"]
["km000505","07","Bedroom"]
["km000505","08","4 Piece Bathroom"]
["km000505","09","Den"]
["km000505","10","Balcony"]
["km000505","11","View of Downtown"]
["km000505","12","Artist Rendition"]
["km000505","13","Artist Rendition"]
["km000505","14","Artist Rendition"]
["km000505","15","Artist Rendition"]
["km000505","16","Artist Rendition"]
["km000503","01","Front"]
["km000503","02","Backyard"]
["km000503","03","Backyard"]
["km000503","04","Backyard"]
["km000503","05","Backyard"]
["km000503","06","Backyard"]
["km000503","07","Foyer"]
["km000503","08","Living Room"]
["km000503","09","Living Room"]
["km000503","10","Dining Room"]
["km000503","11","Dining Room"]
["km000503","12","Kitchen"]
["km000503","13","Kitchen"]
["km000503","14","Kitchen"]
["km000503","15","Family Room"]
["km000503","16","Family Room"]
["km000503","17","Family Room"]
["km000503","18","Main Level Landing"]
["km000503","19","Main Level Landing"]
["km000503","20","Laundry Room"]
["km000503","21","2 Piece Bathroom"]
["km000503","22","Upper Level Landing"]
["km000503","23","Master Bedroom"]
["km000503","24","Master Bedroom"]
["km000503","25","Master Bedroom 4 Piece Ensuite Bathroom"]
["km000503","26","Master Bedroom 4 Piece Ensuite Bathroom"]
["km000503","27","Master Bedroom 4 Piece Ensuite Bathroom"]
["km000503","28","Bedroom"]
["km000503","29","Bedroom"]
["km000503","30","Bedroom"]
["km000503","31","Bedroom"]
["km000503","32","5 Piece Bathroom"]
["km000503","33","5 Piece Bathroom"]
["km000503","34","Recreation Room"]
["km000503","35","Exercise Room"]
["km000503","36","Office"]
["km000503","37","3 Piece Bathroom"]
["km000504","01","Front"]
["km000504","02","Front Entrance"]
["km000504","03","Living Room"]
["km000504","04","Living Room"]
["km000504","05","Living Room"]
["km000504","06","Dining Room"]
["km000504","07","Kitchen"]
["km000504","08","Kitchen"]
["km000504","09","Kitchen"]
["km000504","10","Master Bedroom"]
["km000504","11","Master Bedroom Ensuite 3 Piece Bathroom"]
["km000504","12","Bedroom"]
["km000504","13","4 Piece Bathroom"]
["km000504","14","Treetop View from Balcony"]
["km000504","15","Balcony"]
["km000504","16","Balcony"]
["km000504","17","Playground"]
["km000504","18","Exercise Room"]
["km000504","19","Yoga Room"]
["km000504","20","Party Room"]
["km000504","21","Party Rooom"]
["km000507","01","Front "]
["km000507","02","Front Exterior"]
["km000507","03","Front Exterior"]
["km000507","04","Backyard"]
["km000507","05","Foyer"]
["km000507","06","Living Room"]
["km000507","07","Living Room"]
["km000507","08","Dining Room"]
["km000507","09","Kitchen"]
["km000507","10","Kitchen"]
["km000507","11","Bedroom"]
["km000507","12","Bedroom"]
["km000507","13","Bedroom"]
["km000507","14","4 Piece Bathroom"]
["km000507","15","Recreation Room"]
["km000507","16","Recreation Room"]
["km000507","17","Recreation Room"]
["km000507","18","Lower Level Bedroom"]
["km000507","19","Lower Level 4 Piece Bathroom"]
["km000507","20","Sauna"]
["km000508","01","Front "]
["km000508","02","Front Entrance"]
["km000508","03","Backyard"]
["km000508","04","Backyard"]
["km000508","05","Backyard"]
["km000508","06","Backyard"]
["km000508","07","Backyard"]
["km000508","08","Backyard"]
["km000508","09","Foyer"]
["km000508","10","Living Room"]
["km000508","11","Living/Dining Room"]
["km000508","12","Dining Room"]
["km000508","13","Dining Room"]
["km000508","14","Kitchen"]
["km000508","15","Kitchen"]
["km000508","16","Family Room"]
["km000508","17","Family Room"]
["km000508","18","2 Piece Bathroom"]
["km000508","19","Master Bedroom"]
["km000508","20","Bedroom"]
["km000508","21","Bedroom"]
["km000508","22","Bedroom"]
["km000508","23","4 Piece Bathroom"]
["km000508","24","Recreation Room"]
["km000508","25","Recreation Room"]
["km000508","26","3 Piece Bathroom"]
["km000509","01","Front "]
["km000509","02","Living/Dining Room"]
["km000509","03","Living/Dining Room"]
["km000509","04","Living/Dining Room"]
["km000509","05","Dining Room"]
["km000509","06","Kitchen"]
["km000509","07","Master Bedroom"]
["km000509","08","Master Bedroom 4 Piece Ensuite Bathroom"]
["km000509","09","Den"]
["km000509","10","3 Piece Bathroom"]
["km000509","11","Balcony"]
["km000509","12","Courtyard"]
["km000509","13","Rooftop"]
["km000509","14","Rooftop View"]
["km000509","15","Courtyard"]
["km000509","16","Exercise Room"]
["km000509","17","Exercise Room"]
["km000509","18","Meeting Room"]
["km000509","19","Meeting Room"]
["km000509","20","Library"]
["km000509","21","Convenience Store & Cleaners"]
["km000509","22","Lakeshore"]
["km000509","23","Lakeshore"]
["km000510","01","Front "]
["km000510","02","Backyard"]
["km000510","03","Backyard"]
["km000510","04","Living Room"]
["km000510","05","Living Room"]
["km000510","06","Dining Room"]
["km000510","07","Kitchen"]
["km000510","08","Breakfast Area"]
["km000510","09","Master Bedroom"]
["km000510","10","4 Piece Ensuite Bathroom"]
["km000510","11","Bedroom"]
["km000510","12","Bedroom"]
["km000510","13","4 Piece Bathroom"]
["km000510","14","Laundry Room"]
["km000510","15","Family Room"]
["km000510","16","Family Room"]
["km000511","01","Front "]
["km000511","02","Aerial View"]
["km000511","03","Aerial View with Lot Line"]
["km000511","04","Aerial View with Lot Line"]
["km000511","05","Aerial View with Lot Line"]
["km000511","06","Backyard"]
["km000511","07","Backyard"]
["km000511","08","Backyard"]
["km000511","09","Ravine"]
["km000512","01","Front"]
["km000512","02","Backyard"]
["km000512","03","Backyard"]
["km000512","04","Backyard"]
["km000512","05","Foyer"]
["km000512","06","Kitchen"]
["km000512","07","Kitchen"]
["km000512","08","Kitchen"]
["km000512","09","Living Room"]
["km000512","10","Living/Dining Room"]
["km000512","11","Living/Dining Room"]
["km000512","12","Dining Room"]
["km000512","13","Master Bedroom"]
["km000512","14","Bedroom"]
["km000512","15","Bedroom"]
["km000512","16","4 Piece Bathroom"]
["km000512","17","2 Piece Bathroom"]
["km000512","18","Recreation Room"]
["km000513","01","Front"]
["km000513","02","Backyard"]
["km000513","03","Backyard"]
["km000513","04","Living/Dining Room"]
["km000513","05","Living/Dining Room"]
["km000513","06","Living/Dining Room"]
["km000513","07","Dining Room"]
["km000513","08","Kitchen"]
["km000513","09","Kitchen"]
["km000513","10","Kitchen"]
["km000513","11","Master Bedroom"]
["km000513","12","Master Bedroom 3 Piece Ensuite Bathroom"]
["km000513","13","Bedroom"]
["km000513","14","Bedroom"]
["km000513","15","4 Piece Bathroom"]
["km000513","16","Family Room"]
["km000513","17","Family Room"]
["km000513","18","Family Room"]
["km000513","19","Office"]
["km000514","01","Front"]
["km000514","02","Backyard"]
["km000514","03","Backyard"]
["km000514","04","Living Room"]
["km000514","05","Living Room"]
["km000514","06","Dining Room"]
["km000514","07","Kitchen"]
["km000514","08","Breakfast Area"]
["km000514","09","Family Room"]
["km000514","10","Family Room"]
["km000514","11","2 Piece Bathroom"]
["km000514","12","Master Bedroom"]
["km000514","13","4 Piece Ensuite Bathroom"]
["km000514","14","Bedroom"]
["km000514","15","Bedroom"]
["km000514","16","4 Piece Ensuite Bathroom"]
["km000514","17","Recreation Room"]
["km000514","18","Recreation Room"]
["km000514","19","3 Piece Bathroom"]
["km000516","01","Front "]
["km000516","02","Front Entrance"]
["km000516","03","Backyard"]
["km000516","04","Backyard"]
["km000516","05","Backyard"]
["km000516","06","Backyard"]
["km000516","07","Laurentide Park"]
["km000516","08","Foyer"]
["km000516","09","Living Room"]
["km000516","10","Living Room"]
["km000516","11","Living Room"]
["km000516","12","Dining Room"]
["km000516","13","Kitchen"]
["km000516","14","Kitchen"]
["km000516","15","Kitchen"]
["km000516","16","Master Bedroom"]
["km000516","17","3 Piece Ensuite Bathroom"]
["km000516","18","Bedroom"]
["km000516","19","Bedroom"]
["km000516","20","Bedroom"]
["km000516","21","5 Piece Semi-Ensuite Bathroom"]
["km000516","22","5 Piece Semi-Ensuite Bathroom"]
["km000516","23","Upper Level Landing"]
["km000516","24","Recreation Room"]
["km000516","25","Recreation Room"]
["km000516","26","Wet Bar"]
["km000516","27","2 Piece Bathroom"]
["km000515","01","Front "]
["km000515","02","Backyard"]
["km000515","03","Backyard"]
["km000515","04","Side Yard"]
["km000515","05","Living Room"]
["km000515","06","Living Room"]
["km000515","07","Dining Room"]
["km000515","08","Kitchen"]
["km000515","09","Kitchen"]
["km000515","10","Master Bedroom"]
["km000515","11","2 Piece Ensuite Bathroom"]
["km000515","12","Bedroom"]
["km000515","13","Bedroom"]
["km000515","14","4 Piece Bathroom"]
["km000515","15","Family Room"]
["km000515","16","Family Room"]
["km000515","17","Family Room"]
["km000515","18","3 Piece Bathroom"]
["km000515","19","Bedroom"]
["km000515","20","Recreation Room"]
["km000515","21","Recreation Room"]
["km000515","22","Lower Level Bedroom"]
["km000515","23","Laundry Room"]
["km000517","01","Front "]
["km000517","02","Backyard"]
["km000517","03","Backyard"]
["km000517","04","Backyard"]
["km000517","05","Foyer"]
["km000517","06","Foyer"]
["km000517","07","Dining Room"]
["km000517","08","Kitchen"]
["km000517","09","Kitchen"]
["km000517","10","Kitchen"]
["km000517","11","Breakfast Area"]
["km000517","12","Breakfast Area"]
["km000517","13","Family Room"]
["km000517","14","Family Room"]
["km000517","15","Living Room"]
["km000517","16","Master Bedroom"]
["km000517","17","4 Piece Ensuite Bathroom"]
["km000517","18","Bedroom"]
["km000517","19","Bedroom"]
["km000517","20","4 Piece Bathroom"]
["km000517","21","Games"]
["km000517","22","Recreation Room"]
["km000517","23","Recreation Room"]
["km000517","24","Laundry Room"]
["km000517","25","2 Piece Bathroom"]
["km000520","01","Front "]
["km000520","02","Front Entrance"]
["km000520","03","Backyard"]
["km000520","04","Backyard"]
["km000520","05","Backyard"]
["km000520","06","Foyer"]
["km000520","07","Living Room"]
["km000520","08","Living Room"]
["km000520","09","Living Room"]
["km000520","10","Living Room"]
["km000520","11","Dining Room"]
["km000520","12","Kitchen"]
["km000520","13","Kitchen"]
["km000520","14","Kitchen"]
["km000520","15","Bedroom"]
["km000520","16","Bedroom"]
["km000520","17","Bedroom"]
["km000520","18","5 Piece Bathroom"]
["km000520","19","Master Bedroom"]
["km000520","20","Master Bedroom 3 Piece Ensuite Bathroom"]
["km000520","21","Recreation Room"]
["km000520","22","Recreation Room"]
["km000521","01","Front "]
["km000521","02","Backyard"]
["km000521","03","Backyard"]
["km000521","04","Living Room"]
["km000521","05","Living/Dining Room"]
["km000521","06","Dining Room"]
["km000521","07","Kitchen"]
["km000521","08","Kitchen"]
["km000521","09","Sunroom"]
["km000521","10","Master Bedroom"]
["km000521","11","2 Piece Ensuite Bathroom"]
["km000521","12","4 Piece Bathroom"]
["km000521","13","Bedroom"]
["km000521","14","Bedroom"]
["km000521","15","Family Room"]
["km000521","16","Family Room"]
["km000521","17","Family Room"]
["km000521","18","Office/Bedroom"]
["km000521","19","Recreation Room"]
["km000521","20","3 Piece Bathroom"]
["km000522","01","Front Entrance"]
["km000522","02","Foyer"]
["km000522","03","Living Room"]
["km000522","04","Living Room"]
["km000522","05","Dining Room"]
["km000522","06","Kitchen"]
["km000522","07","Breakfast Area"]
["km000522","08","Master Bedroom"]
["km000522","09","4 Piece Ensuite Bathroom"]
["km000522","10","Bedroom"]
["km000522","11","4 Piece Bathroom"]
["km000522","12","Terrace"]
["km000522","13","Laundry Room"]
["km000518","01","Front "]
["km000518","02","Front Entrance"]
["km000518","03","Backyard"]
["km000518","04","Backyard"]
["km000518","05","Backyard"]
["km000518","06","Foyer"]
["km000518","07","Living Room"]
["km000518","08","Living Room"]
["km000518","09","Living/Dining Room"]
["km000518","10","Living/Dining Room"]
["km000518","11","Dining Room"]
["km000518","12","Kitchen"]
["km000518","13","Kitchen"]
["km000518","14","4 Season Solarium"]
["km000518","15","Family Room"]
["km000518","16","Family Room"]
["km000518","17","Master Bedroom"]
["km000518","18","Master Bedroom"]
["km000518","19","Master Bedroom 3 Piece Ensuite Bathroom"]
["km000518","20","Bedroom"]
["km000518","21","Bedroom"]
["km000518","22","4 Piece Bathroom"]
["km000518","23","Bedroom"]
["km000518","24","Bedroom"]
["km000518","25","Recreation Room"]
["km000518","26","Recreation Room"]
["km000523","01","Front "]
["km000523","02","Front Entrance"]
["km000523","03","Foyer"]
["km000523","04","Powder Room"]
["km000523","05","Living Room"]
["km000523","06","Living Room"]
["km000523","07","Living Room"]
["km000523","08","Kitchen"]
["km000523","09","Kitchen"]
["km000523","10","Kitchen"]
["km000523","11","Kitchen"]
["km000523","12","Kitchen"]
["km000523","13","Dining Room"]
["km000523","14","Mud Room"]
["km000523","15","Master Bedroom"]
["km000523","16","4 Piece Ensuite Bathroom"]
["km000523","17","4 Piece Ensuite Bathroom"]
["km000523","18","Bedroom"]
["km000523","19","Bedroom"]
["km000523","20","4 Piece Bathroom"]
["km000523","21","Hallway & Wine Cellar"]
["km000523","22","Hallway & Wine Cellar"]
["km000523","23","Wine Cellar"]
["km000523","24","Recreation/Family Room "]
["km000523","25","Recreation/Family Room "]
["km000523","26","3 Piece Bathroom"]
["km000523","27","Bedroom"]
["km000523","28","Bedroom"]
["km000523","29","Den/Exercise Room"]
["km000523","30","Laundry Room"]
["km000523","31","Backyard"]
["km000523","32","Backyard"]
["km000523","33","Backyard"]
["km000523","34","Backyard"]
["km000523","35","Backyard"]
["km000523","36","Backyard"]
["km000523","37","Backyard"]
["km000523","38","Backyard"]
["km000523","39","Backyard"]
["km000523","40","Backyard"]
["km000524","01","Front"]
["km000524","02","Front Porch"]
["km000524","03","Backyard"]
["km000524","04","Backyard"]
["km000524","05","Living Room"]
["km000524","06","Living Room"]
["km000524","07","Living Room"]
["km000524","08","Kitchen"]
["km000524","09","Kitchen"]
["km000524","10","Dining Room"]
["km000524","11","Master Bedroom"]
["km000524","12","Master Bedroom"]
["km000524","13","Bedroom"]
["km000524","14","4 Piece Bathroom"]
["km000524","15","Recreation Room"]
["km000524","16","2 Piece Bathroom"]
["km000525","01","Front"]
["km000525","02","Front Entrance"]
["km000525","03","Backyard"]
["km000525","04","Foyer"]
["km000525","05","Living Room"]
["km000525","06","Living Room"]
["km000525","07","Living Room"]
["km000525","08","Dining Room"]
["km000525","09","Kitchen"]
["km000525","10","Breakfast Area"]
["km000525","11","Master Bedroom"]
["km000525","12","Bedroom"]
["km000525","13","Bedroom"]
["km000525","14","4 Piece Bathroom"]
["km000525","15","Recreation Room"]
["km000519","01","Front"]
["km000519","02","Backyard"]
["km000519","03","Backyard"]
["km000519","04","Foyer"]
["km000519","05","Kitchen"]
["km000519","06","Kitchen"]
["km000519","07","Kitchen"]
["km000519","08","Dining Room "]
["km000519","09","Living Room"]
["km000519","10","Living Room"]
["km000519","11","Living Room"]
["km000519","12","Family Room"]
["km000519","13","Family Room"]
["km000519","14","Master Bedroom"]
["km000519","15","Master Bedroom"]
["km000519","16","Master Bedroom 5 Piece Ensuite Bathroom"]
["km000519","17","Bedroom"]
["km000519","18","Bedroom"]
["km000519","19","2 Piece Ensuite Bathroom"]
["km000519","20","Bedroom"]
["km000519","21","4 Piece Bathroom"]
["km000519","22","2 Piece Bathroom"]
["km000519","23","Laundry Room"]
["km000527","01","Front "]
["km000527","02","Backyard"]
["km000527","03","Backyard"]
["km000527","04","Backyard"]
["km000527","05","Backyard"]
["km000527","06","Front Entrance"]
["km000527","07","Front Entrance"]
["km000527","08","Foyer"]
["km000527","09","Kitchen"]
["km000527","10","Breakfast Area"]
["km000527","11","Kitchen"]
["km000527","12","Kitchen"]
["km000527","13","Dining Room"]
["km000527","14","Dining Room"]
["km000527","15","Living Room"]
["km000527","16","Living Room"]
["km000527","17","Living Room"]
["km000527","18","Living Room"]
["km000527","19","Master Bedroom"]
["km000527","20","Master Bedroom"]
["km000527","21","3 Piece Ensuite Bathroom"]
["km000527","22","Bedroom"]
["km000527","23","Bedroom"]
["km000527","24","4 Piece Bathroom"]
["km000527","25","Games Room"]
["km000527","26","Games/Flex Room"]
["km000527","27","Games Room"]
["km000527","28","Family Room"]
["km000527","29","Family Room"]
["km000527","30","Flex Room"]
["km000527","31","Lower Level Bedroom"]
["km000527","32","2 Piece Bathroom"]
["km000527","33","Laundry Room"]
["km000526","01","Front"]
["km000526","02","Backyard"]
["km000526","03","Living Room"]
["km000526","04","Living Room"]
["km000526","05","Living Room"]
["km000526","06","Dining Room"]
["km000526","07","Kitchen"]
["km000526","08","Kitchen"]
["km000526","09","Kitchen"]
["km000526","10","Master Bedroom"]
["km000526","11","4 Piece Bathroom"]
["km000526","12","Bedroom"]
["km000526","13","Bedroom"]
["km000526","14","Lower Level Kitchen"]
["km000526","15","Lower Level Kitchen"]
["km000526","16","Recreation Room"]
["km000526","17","Recreation Room"]
["km000526","18","3 Piece Bathroom"]
["km000526","19","Bedroom"]
["km000528","01","Front"]
["km000528","02","Backyard"]
["km000528","03","Backyard"]
["km000528","04","Living Room"]
["km000528","05","Living Room"]
["km000528","06","Dining Room"]
["km000528","07","Kitchen"]
["km000528","08","Kitchen"]
["km000528","09","Kitchen"]
["km000528","10","Bedroom"]
["km000528","11","Bedroom"]
["km000528","12","Bedroom"]
["km000528","13","4 Piece Bathroom"]
["km000528","14","Recreation Room"]
["km000528","15","Recreation Room"]
["km000528","16","3 Piece Bathroom"]
["km000529","01","Front"]
["km000529","02","Backyard"]
["km000529","03","Backyard"]
["km000529","04","Backyard"]
["km000529","05","Backyard"]
["km000529","06","Backyard"]
["km000529","07","Foyer"]
["km000529","08","Foyer"]
["km000529","09","Living Room"]
["km000529","10","Kitchen"]
["km000529","11","Kitchen"]
["km000529","12","Kitchen"]
["km000529","13","Dining Room"]
["km000529","14","Dining Room"]
["km000529","15","Family Room"]
["km000529","16","Family Room"]
["km000529","17","Family Room"]
["km000529","18","Office"]
["km000529","19","2 Piece Powder Room"]
["km000529","20","Laundry Room"]
["km000529","21","Upper Landing"]
["km000529","22","Upper Landing"]
["km000529","23","Master Bedroom"]
["km000529","24","Master Bedroom"]
["km000529","25","Sitting Room"]
["km000529","26","6 Piece Ensuite Bathroom"]
["km000529","27","Bedroom"]
["km000529","28","4 Piece Semi Ensuite Bathroom"]
["km000529","29","Bedroom"]
["km000529","30","Bedroom"]
["km000529","31","4 Piece Ensuite Bathroom"]
["km000529","32","Bedroom"]
["km000529","33","4 Piece Semi Ensuite Bathroom"]
["km000529","34","Lower Landing"]
["km000529","35","Recreation Room"]
["km000529","36","Recreation Room"]
["km000529","37","Kitchen"]
["km000529","38","Games Room"]
["km000529","39","Games Room"]
["km000529","40","Bedroom"]
["km000529","41","Bedroom"]
["km000529","42","4 Piece Bathroom"]
["km000530","01","Front "]
["km000530","02","Ravine View"]
["km000530","03","Kitchen"]
["km000530","04","Dining Room"]
["km000530","05","Living/Dining Room"]
["km000530","06","Living Room"]
["km000530","07","Living/Dining Room"]
["km000530","08","Living Room/Solarium"]
["km000530","09","Solarium"]
["km000530","10","Solarium"]
["km000530","11","Master Bedroom"]
["km000530","12","Master Bedroom"]
["km000530","13","4 Piece Ensuite Bathroom"]
["km000530","14","Bedroom"]
["km000530","15","Bedroom"]
["km000530","16","3 Piece Bathroom"]
["km000531","01","Foyer"]
["km000531","02","Foyer"]
["km000531","03","Living & Dining Room"]
["km000531","04","Living Room"]
["km000531","05","Dining Room"]
["km000531","06","Dining & Living Room"]
["km000531","07","Living Room"]
["km000531","08","Living Room & Kitchen"]
["km000531","09","Living Room & Kitchen"]
["km000531","10","Dining Room"]
["km000531","11","Kitchen"]
["km000531","12","Kitchen"]
["km000531","13","Kitchen"]
["km000531","14","Master Bedroom"]
["km000531","15","Master Bedroom"]
["km000531","16","Master Bedroom"]
["km000531","17","6 Piece Ensuite Bathroom"]
["km000531","18","6 Piece Ensuite Bathroom"]
["km000531","19","Terrace"]
["km000531","20","Bedroom"]
["km000531","21","3 Piece Ensuite Bathroom"]
["km000531","22","Bedroom"]
["km000531","23","Bedroom"]
["km000531","24","Panoramic Views"]
["km000531","25","2 Piece Powder Room"]
["km000531","26","Front Entrance"]
["km000531","27","Front Entrance"]
["km000531","28","Pool"]
["km000534","01","Front Entrance"]
["km000534","02","Front Entrance"]
["km000534","03","Kitchen"]
["km000534","04","Kitchen"]
["km000534","05","Kitchen"]
["km000534","06","Living Room"]
["km000534","07","Master Bedroom"]
["km000534","08","4 Piece Bathroom"]
["km000534","09","Balcony"]
["km000532","01","Front"]
["km000532","02","Backyard"]
["km000532","03","Living Room"]
["km000532","04","Living & Dining Room"]
["km000532","05","Dining Room"]
["km000532","06","Kitchen"]
["km000532","07","Kitchen"]
["km000532","08","Kitchen"]
["km000532","09","Master Bedroom"]
["km000532","10","Master Bedroom"]
["km000532","11","Bedroom"]
["km000532","12","Bedroom"]
["km000532","13","4 Piece Bathroom"]
["km000532","14","Recreation Room"]
["km000532","15","Recreation Room"]
["km000532","16","Recreation Room"]
["km000532","17","Office"]
["km000532","18","3 Piece Bathroom"]
["km000532","19","3 Piece Bathroom"]
["km000532","20","3 Piece Bathroom"]
["km000536","01","Front"]
["km000536","02","Front Yard"]
["km000536","03","Front Porch"]
["km000536","04","Backyard"]
["km000536","05","Backyard"]
["km000536","06","Living Room"]
["km000536","07","Living Room"]
["km000536","08","Living & Dining Room"]
["km000536","09","Dining Room"]
["km000536","10","Kitchen"]
["km000536","11","Kitchen"]
["km000536","12","Master Bedroom"]
["km000536","13","Bedroom"]
["km000536","14","Bedroom"]
["km000536","15","4 Piece Bathroom"]
["km000536","16","Recreation Room"]
["km000536","17","Recreation Room"]
["km000533","01","Front"]
["km000533","02","Front"]
["km000533","03","Backyard"]
["km000533","04","Living Room"]
["km000533","05","Living & Dining Room"]
["km000533","06","Dining Room"]
["km000533","07","Kitchen"]
["km000533","08","Kitchen"]
["km000533","09","Kitchen"]
["km000533","10","Master Bedroom"]
["km000533","11","Bedroom"]
["km000533","12","Bedroom"]
["km000533","13","4 Piece Bathroom"]
["km000533","14","Recreation Room"]
["km000533","15","3 Piece Bathroom"]
["km000533","16","Utility/Laundry Room"]
["km000533","17","Den"]
["km000535","01","Front"]
["km000535","02","Backyard"]
["km000535","03","Backyard"]
["km000535","04","Backyard"]
["km000535","05","Backyard"]
["km000535","06","Backyard"]
["km000535","07","Backyard"]
["km000535","08","Living Room"]
["km000535","09","Living Room"]
["km000535","10","Living Room"]
["km000535","11","Dining Room"]
["km000535","12","Dining Room"]
["km000535","13","Kitchen & Family Room"]
["km000535","14","Family Room"]
["km000535","15","Family Room"]
["km000535","16","Breakfast Area"]
["km000535","17","Kitchen"]
["km000535","18","Kitchen"]
["km000535","19","Kitchen"]
["km000535","20","Kitchen"]
["km000535","21","Kitchen"]
["km000535","22","Family Room & Breakfast Area"]
["km000535","23","Family Room & Breakfast Area"]
["km000535","24","Family Room, Breakfast Area & Kitchen"]
["km000535","25","Hallway"]
["km000535","26","Laundry Room"]
["km000535","27","2 Piece Bathroom"]
["km000535","28","Master Bedroom"]
["km000535","29","Master Bedroom"]
["km000535","30","Master Bedroom"]
["km000535","31","3 Piece Ensuite Bathroom"]
["km000535","32","Bedroom"]
["km000535","33","5 Piece Bathrooom"]
["km000535","34","Bedroom"]
["km000535","35","Bedroom"]
["km000535","36","Bedroom"]
["km000535","37","Recreation Room"]
["km000535","38","Recreation Room"]
["km000535","39","Games Room"]
["km000535","40","4 Piece Bathroom"]
["km000535","41","Bedroom"]
["km000537","01","Front"]
["km000537","02","Front Entrance"]
["km000537","03","View of Inground Swimming Pool"]
["km000537","04","Balcony"]
["km000537","05","Living Room"]
["km000537","06","Living Room"]
["km000537","07","Living Room"]
["km000537","08","Living Room"]
["km000537","09","Dining Room"]
["km000537","10","Dining Room"]
["km000537","11","Dining Room"]
["km000537","12","Living Room"]
["km000537","13","Kitchen"]
["km000537","14","Kitchen"]
["km000537","15","Breakfast Area"]
["km000537","16","Breakfast Area"]
["km000537","17","Master Bedroom"]
["km000537","18","Master Bedroom"]
["km000537","19","4 Piece Bathroom"]
["km000537","20","Aerial View"]
["km000538","01","Front"]
["km000538","02","Backyard"]
["km000538","03","Backyard"]
["km000538","04","Living Room"]
["km000538","05","Living & Dining Room"]
["km000538","06","Dining Room"]
["km000538","07","Kitchen"]
["km000538","08","Kitchen"]
["km000538","09","Master Bedroom"]
["km000538","10","4 Piece Bathroom"]
["km000538","11","Bedroom"]
["km000538","12","Recreation Room"]
["km000538","13","Recreation Room"]
["km000540","01","Front"]
["km000540","02","Front Entrance"]
["km000540","03","Backyard"]
["km000540","04","Backyard"]
["km000540","05","Backyard"]
["km000540","06","Backyard"]
["km000540","07","Foyer"]
["km000540","08","Living/Dining Room"]
["km000540","09","Living Room"]
["km000540","10","Living Room"]
["km000540","11","Living Room"]
["km000540","12","Living Room"]
["km000540","13","Dining Room"]
["km000540","14","Dining Room"]
["km000540","15","Dining Room"]
["km000540","16","Dining Room"]
["km000540","17","Kitchen"]
["km000540","18","Kitchen"]
["km000540","19","Kitchen"]
["km000540","20","Kitchen"]
["km000540","21","Kitchen"]
["km000540","22","Kitchen"]
["km000540","23","Kitchen"]
["km000540","24","Mud Room"]
["km000540","25","Dog Wash"]
["km000540","26","2 Piece Powder Room"]
["km000540","27","Master Bedroom"]
["km000540","28","Master Bedroom"]
["km000540","29","Master Bedroom Walk-in Closet"]
["km000540","30","Master Bedroom Walk-in Closet"]
["km000540","31","Master Bedroom 5 Piece Ensuite Bathroom"]
["km000540","32","Master Bedroom 5 Piece Ensuite Bathroom"]
["km000540","33","Master Bedroom 5 Piece Ensuite Bathroom"]
["km000540","34","Master Bedroom 5 Piece Ensuite Bathroom"]
["km000540","35","Master Bedroom 5 Piece Ensuite Bathroom"]
["km000540","36","Office"]
["km000540","37","Staircase"]
["km000540","38","Upper Staircase"]
["km000540","39","Bedroom"]
["km000540","40","3 Piece Ensuite Bathroom"]
["km000540","41","Bedroom"]
["km000540","42","Bedroom"]
["km000540","43","5 Piece Semi-Ensuite Bathroom"]
["km000540","44","5 Piece Semi-Ensuite Bathroom"]
["km000540","45","5 Piece Semi-Ensuite Bathroom"]
["km000540","46","Bedroom"]
["km000540","47","Bedroom"]
["km000540","48","Recreation Room"]
["km000540","49","Recreation Room"]
["km000540","50","3 Piece Bathroom"]
["km000540","51","Storage Room"]
["km000540","52","Laundry Room"]
["km000540","53","Storage Room"]
["km000539","01","Front"]
["km000539","02","Backyard"]
["km000539","03","Backyard"]
["km000539","04","Living Room"]
["km000539","05","Living Room"]
["km000539","06","Living & Dining Room"]
["km000539","07","Living & Dining Room"]
["km000539","08","Dining Room"]
["km000539","09","Dining Room"]
["km000539","10","Kitchen"]
["km000539","11","Kitchen"]
["km000539","12","Master Bedroom"]
["km000539","13","Master Bedroom"]
["km000539","14","3 Piece Ensuite Bathroom"]
["km000539","15","Bedroom"]
["km000539","16","Bedroom"]
["km000539","17","4 Piece Bathroom"]
["km000539","18","Recreation Room"]
["km000539","19","Recreation Room"]
["km000539","20","Recreation Room"]
["km000539","21","Recreation Room"]
["km000539","22","Lower Level Kitchen"]
["km000539","23","Lower Level Kitchen"]
["km000539","24","Bedroom"]
["km000539","25","3 Piece Bathroom"]
["km000541","01","Front"]
["km000541","02","Front"]
["km000541","03","Backyard"]
["km000541","04","Backyard"]
["km000541","05","Backyard"]
["km000541","06","Living Room"]
["km000541","07","Living & Dining Room"]
["km000541","08","Dining Room"]
["km000541","09","Kitchen"]
["km000541","10","Kitchen"]
["km000541","11","Master Bedroom"]
["km000541","12","Bedroom"]
["km000541","13","Bedroom"]
["km000541","14","4 Piece Bathroom"]
["km000541","15","Recreation Room"]
["km000541","16","Recreation Room"]
["km000541","17","Recreation Room"]
["km000541","18","Second Kitchen"]
["km000541","19","Second Kitchen"]
["km000541","20","Recreation Room"]
["km000541","21","Bedroom"]
["km000541","22","Exercise Room"]
["km000541","23","3 Piece Bathroom"]
["km000543","01","Lobby"]
["km000543","02","Kitchen"]
["km000543","03","Living Room"]
["km000543","04","Kitchen, Living Room & Dining Room"]
["km000543","05","Living Room"]
["km000543","06","Living Room"]
["km000543","07","Dining Room"]
["km000543","08","Balcony"]
["km000543","09","Bedroom"]
["km000543","10","Bedroom"]
["km000543","11","4 Piece Bathroom"]
["km000543","12","View"]
["km000543","13","Exercise Room"]
["km000543","14","Exercise Room"]
["km000543","15","Sauna"]
["km000543","16","Party Room"]
["km000543","17","Yogo Room"]
["km000542","01","Front"]
["km000542","02","Backyard"]
["km000542","03","Backyard"]
["km000542","04","Foyer"]
["km000542","05","Foyer"]
["km000542","06","Living Room"]
["km000542","07","Living & Dining Room"]
["km000542","08","Living Room"]
["km000542","09","Dining Room"]
["km000542","10","Kitchen"]
["km000542","11","Kitchen"]
["km000542","12","Master Bedroom"]
["km000542","13","Bedroom"]
["km000542","14","Bedroom"]
["km000542","15","4 Piece Bathroom"]
["km000542","16","Family Room"]
["km000542","17","4 Piece Bathroom"]
["km000542","18","4 Piece Bathroom"]
["km000542","19","Bedroom"]
["km000542","20","Recreation Room"]
["km000544","01","Front"]
["km000544","02","Backyard"]
["km000544","03","Backyard"]
["km000544","04","Backyard"]
["km000544","05","Foyer & Living Room"]
["km000544","06","Living Room"]
["km000544","07","Living & Dining Room"]
["km000544","08","Living Room"]
["km000544","09","Living & Dining Room"]
["km000544","10","Staircase"]
["km000544","11","Dining Room"]
["km000544","12","Dining & Living Room"]
["km000544","13","Dining & Living Room"]
["km000544","14","Kitchen & Breakfast Area"]
["km000544","15","Kitchen"]
["km000544","16","Kitchen"]
["km000544","17","Breakfast Area"]
["km000544","18","Breakfast Area"]
["km000544","19","Family Room & Kitchen"]
["km000544","20","Kitchen, Breakfast Area & Family Room"]
["km000544","21","Family Room"]
["km000544","22","2 Piece Powder Room"]
["km000544","23","Master Bedroom"]
["km000544","24","Bedroom"]
["km000544","25","Bedroom"]
["km000544","26","Bedroom"]
["km000544","27","Upper Staircase"]
["km000544","28","Recreation Room"]
["km000544","29","Media Room"]
["km000544","30","Media Room"]
["km000544","31","Media Room"]
["km000544","32","3 Piece Bathroom"]
["km000546","01","Front"]
["km000546","02","Living & Dining Room"]
["km000546","03","Living Room & Kitchen"]
["km000546","04","Kitchen"]
["km000546","05","Dining Room"]
["km000546","06","Master Bedroom"]
["km000546","07","Master Bedroom"]
["km000546","08","3 Piece Ensuite Bathroom"]
["km000546","09","Den"]
["km000546","10","4 Piece Bathroom"]
["km000546","11","Balcony"]
["km000546","12","Western View of Toronto Skyline from Balcony"]
["km000546","13","Western View of Toronto Skyline from Balcony"]
["km000546","14","Party Room"]
["km000546","15","Party Room"]
["km000546","16","Party Room"]
["km000546","17","Party Room"]
["km000547","01","Front"]
["km000547","02","Living Room"]
["km000547","03","Dining Room"]
["km000547","04","Kitchen"]
["km000547","05","Master Bedroom"]
["km000547","06","5 Piece Ensuite Bathroom"]
["km000547","07","5 Piece Ensuite Bathroom"]
["km000547","08","Bedroom"]
["km000547","09","Bedroom"]
["km000547","10","3 Piece Bathroom"]
["km000547","11","Rooftop Terrace"]
["km000547","12","View From Rooftop"]
["km000547","13","Recreation Room"]
["km000547","14","Recreation Room"]
["km000547","15","2 Piece Powder Room"]
["km000548","01","Front"]
["km000548","02","Backyard"]
["km000548","03","Backyard"]
["km000548","04","Foyer"]
["km000548","05","Living Room"]
["km000548","06","Living Room"]
["km000548","07","Living Room"]
["km000548","08","Living & Dining Room"]
["km000548","09","Dining Room"]
["km000548","10","Kitchen"]
["km000548","11","Kitchen"]
["km000548","12","Master Bedroom"]
["km000548","13","Bedroom"]
["km000548","14","Bedroom"]
["km000548","15","4 Piece Bathroom"]
["km000548","16","Recreation Room"]
["km000548","17","Recreation Room"]
["km000548","18","Office"]
["km000548","19","Bedroom"]
["km000548","20","3 Piece Bathroom"]
["km000549","01","Front"]
["km000549","02","Front"]
["km000549","03","Backyard"]
["km000549","04","Living Room"]
["km000549","05","Living Room"]
["km000549","06","Living Room"]
["km000549","07","Breakfast Area"]
["km000549","08","Kitchen"]
["km000549","09","Kitchen"]
["km000549","10","Dining Room"]
["km000549","11","Master Bedroom"]
["km000549","12","Master Bedroom"]
["km000549","13","Bedroom"]
["km000549","14","Bedroom"]
["km000549","15","4 Piece Bathroom"]
["km000549","16","Recreation Room"]
["km000549","17","Laundry Room"]
["km000552","01","Front"]
["km000552","02","Backyard"]
["km000552","03","Backyard"]
["km000552","04","Foyer"]
["km000552","05","Dining Room"]
["km000552","06","Dining Room"]
["km000552","07","Kitchen"]
["km000552","08","Kitchen"]
["km000552","09","Dining Room & Kitchen"]
["km000552","10","Family Room"]
["km000552","11","Family Room"]
["km000552","12","Family Room"]
["km000552","13","Living Room"]
["km000552","14","Living Room"]
["km000552","15","Master Bedroom"]
["km000552","16","Master Bedroom"]
["km000552","17","Bedroom"]
["km000552","18","Bedroom"]
["km000552","19","4 Piece Bathroom"]
["km000552","20","3 Piece Bathroom"]
["km000552","21","Office/Den"]
["km000552","22","Exercise Room"]
["km000550","01","Front"]
["km000550","02","Backyard"]
["km000550","03","Backyard"]
["km000550","04","Backyard"]
["km000550","05","Living Room"]
["km000550","06","Living Room"]
["km000550","07","Living Room"]
["km000550","08","Living Room"]
["km000550","09","Dining Room"]
["km000550","10","Dining Room"]
["km000550","11","Kitchen"]
["km000550","12","Kitchen"]
["km000550","13","Kitchen"]
["km000550","14","2 Piece Powder Room"]
["km000550","15","Master Bedroom"]
["km000550","16","3 Piece Ensuite Bathroom"]
["km000550","17","Bedroom"]
["km000550","18","Bedroom"]
["km000550","19","4 Piece Bathroom"]
["km000550","20","Recreation Room"]
["km000550","21","Recreation Room"]
["km000551","01","Front"]
["km000551","02","Backyard"]
["km000551","03","Foyer"]
["km000551","04","Living Room"]
["km000551","05","Living Room"]
["km000551","06","Living Room"]
["km000551","07","Living Room"]
["km000551","08","Dining Room"]
["km000551","09","Kitchen"]
["km000551","10","Kitchen & Breakfast Area"]
["km000551","11","Breakfast Area"]
["km000551","12","2 Piece Powder Room"]
["km000551","13","Master Bedroom"]
["km000551","14","Master Bedroom"]
["km000551","15","4 Piece Ensuite Bathroom"]
["km000551","16","4 Piece Ensuite Bathroom"]
["km000551","17","Bedroom"]
["km000551","18","Bedroom"]
["km000551","19","4 Piece Bathroom"]
["km000551","20","Family Room"]
["km000551","21","Family Room"]
["km000551","22","Laundry Room"]
["km000545","01","Front"]
["km000545","02","Backyard"]
["km000545","03","Backyard"]
["km000545","04","Backyard"]
["km000545","05","Backyard"]
["km000545","06","Backyard"]
["km000545","07","Golf Practice Net"]
["km000545","08","Aerial View"]
["km000545","09","Foyer"]
["km000545","10","Foyer"]
["km000545","11","Living Room"]
["km000545","12","Living Room"]
["km000545","13","Living Room"]
["km000545","14","Dining Room"]
["km000545","15","Dining Room"]
["km000545","16","Dining Room"]
["km000545","17","Kitchen"]
["km000545","18","Kitchen"]
["km000545","19","Kitchen"]
["km000545","20","Breakfast Area"]
["km000545","21","Breakfast Area"]
["km000545","22","Family Room"]
["km000545","23","Family Room"]
["km000545","24","2 Piece Powder Room"]
["km000545","25","Office"]
["km000545","26","Upper Landing"]
["km000545","27","Master Bedroom"]
["km000545","28","Master Bedroom"]
["km000545","29","5 Piece Ensuite Bathroom"]
["km000545","30","5 Piece Ensuite Bathroom"]
["km000545","31","5 Piece Ensuite Bathroom"]
["km000545","32","Bedroom"]
["km000545","33","Bedroom"]
["km000545","34","Bedroom"]
["km000545","35","Bedroom"]
["km000545","36","Jack & Jill 5 Piece Bathroom"]
["km000545","37","Jack & Jill 5 Piece Bathroom"]
["km000545","38","Bedroom"]
["km000545","39","Bedroom"]
["km000545","40","Laundry Room"]
["km000545","41","4 Piece Bathroom"]
["km000545","42","Lower Landing"]
["km000545","43","Cold Storage/Wine Room"]
["km000545","44","Gym"]
["km000545","45","Recreation Room"]
["km000545","46","Recreation Room"]
["km000545","47","Music Stage"]
["km000545","48","Bedroom/Nanny's Suite"]
["km000545","49","4 Piece Bathroom"]
["km000553","01","Front"]
["km000553","02","Backyard"]
["km000553","03","Backyard"]
["km000553","04","Backyard"]
["km000553","05","Backyard"]
["km000553","06","Backyard"]
["km000553","07","Family Room"]
["km000553","08","Family Room"]
["km000553","09","Living Room"]
["km000553","10","Living & Dining Room"]
["km000553","11","Dining Room"]
["km000553","12","Kitchen"]
["km000553","13","Kitchen"]
["km000553","14","Kitchen"]
["km000553","15","Upper Landing"]
["km000553","16","Master Bedroom"]
["km000553","17","Deck from Master Bedroom"]
["km000553","18","4 Piece Bathroom"]
["km000553","19","Bedroom"]
["km000553","20","Recreation Room"]
["km000553","21","Cabana 3 Piece Bathroom"]
["km000553","22"," Aerial"]
["km000556","01","Front"]
["km000556","02","Backyard"]
["km000556","03","Kitchen"]
["km000556","04","Kitchen"]
["km000556","05","Kitchen"]
["km000556","06","Dining Room"]
["km000556","07","Dining Room"]
["km000556","08","Living Room"]
["km000556","09","Living Room"]
["km000556","10","Living Room"]
["km000556","11","Family Room"]
["km000556","12","Family Room"]
["km000556","13","Bedroom"]
["km000556","14","3 Piece Bathroom"]
["km000556","15","4 Piece Bathroom"]
["km000556","16","Master Bedroom"]
["km000556","17","Master Bedroom"]
["km000556","18","4 Piece Ensuite Bathroom"]
["km000556","19","Dressing Room"]
["km000556","20","Lower Landing"]
["km000556","21","Exercise Room"]
["km000556","22","2 Piece Powder Room"]
["km000554","01","Front"]
["km000554","02","Front"]
["km000554","03","Front"]
["km000554","04","Front"]
["km000554","05","Front Porch"]
["km000554","06","Front Porch"]
["km000554","07","Front Porch"]
["km000554","08","Front Porch"]
["km000554","09","Foyer"]
["km000554","10","Living Room"]
["km000554","11","Living Room"]
["km000554","12","Living Room"]
["km000554","13","Dining Room"]
["km000554","14","Dining Room"]
["km000554","15","Kitchen"]
["km000554","16","Kitchen"]
["km000554","17","Kitchen"]
["km000554","18","Breakfast Area"]
["km000554","19","Master Bedroom"]
["km000554","20","Master Bedroom"]
["km000554","21","3 Piece Bathroom"]
["km000554","22","Balcony"]
["km000554","23","Balcony"]
["km000554","24","Bedroom/Nursery"]
["km000554","25","Bedroom"]
["km000554","26","Bedroom"]
["km000554","27","4 Piece Bathroom"]
["km000554","28","Family Room"]
["km000554","29","Family Room"]
["km000554","30","Family Room"]
["km000554","31","Family Room"]
["km000554","32","Office"]
["km000554","33","Exercise Room"]
["km000554","34","Lower Level Bedroom"]
["km000554","35","3 Piece Bathroom"]
["km000554","36","Backyard"]
["km000554","37","Backyard"]
["km000554","38","Backyard"]
["km000554","39","Backyard"]
["km000555","01","Front"]
["km000555","02","Backyard"]
["km000555","03","Backyard"]
["km000555","04","Living & Dining Room"]
["km000555","05","Living Room"]
["km000555","06","Living & Dining Room"]
["km000555","07","Dining Room"]
["km000555","08","Kitchen"]
["km000555","09","Breakfast Area"]
["km000555","10","Master Bedroom"]
["km000555","11","Master Bedroom"]
["km000555","12","4 Piece Bathroom"]
["km000555","13","Bedroom"]
["km000555","14","Bedroom"]
["km000555","15","Recreation Room"]
["km000555","16","Recreation Room"]
["km000555","17","Workshop"]
["km000559","01","Front"]
["km000559","02","Front Porch"]
["km000559","03","Living Room"]
["km000559","04","Living Room"]
["km000559","05","Dining Room"]
["km000559","06","Dining Room"]
["km000559","07","Kitchen"]
["km000559","08","Kitchen"]
["km000559","09","Kitchen"]
["km000559","10","Office"]
["km000559","11","Master Bedroom"]
["km000559","12","Master Bedroom"]
["km000559","13","3 Piece Ensuite Bathroom"]
["km000559","14","Bedroom"]
["km000559","15","Bedroom"]
["km000559","16","Bedroom"]
["km000559","17","Bedroom"]
["km000559","18","4 Piece Bathroom"]
["km000559","19","Recreation Room"]
["km000559","20","Recreation Room"]
["km000559","21","Lower Level Kitchen"]
["km000559","22","4 Piece Bathroom"]
["km000559","23","Bedroom"]
["km000559","24","Backyard"]
["km000559","25","Backyard"]
["km000559","26","Backyard"]
["km000558","01","Front"]
["km000558","02","Backyard"]
["km000558","03","Backyard"]
["km000558","04","Backyard"]
["km000558","05","Foyer"]
["km000558","06","Foyer"]
["km000558","07","Living Room"]
["km000558","08","Living Room"]
["km000558","09","Living & Dining Room"]
["km000558","10","Dining Room"]
["km000558","11","Kitchen"]
["km000558","12","Kitchen"]
["km000558","13","Master Bedroom"]
["km000558","14","4 Piece Semi-Ensuite Bathroom"]
["km000558","15","Bedroom"]
["km000558","16","Bedroom/Office"]
["km000558","17","Lower Landing"]
["km000558","18","Recreation Room"]
["km000558","19","Recreation Room"]
["km000558","20","Lower Level Bedroom"]
["km000558","21","3 Piece Bathroom"]
["km000560","01","Front"]
["km000560","02","Backyard"]
["km000560","03","Backyard"]
["km000560","04","Backyard"]
["km000560","05","Backyard"]
["km000560","06","Backyard"]
["km000560","07","Backyard"]
["km000560","08","Kitchen"]
["km000560","09","Kitchen"]
["km000560","10","Dining Room"]
["km000560","11","Dining Room"]
["km000560","12","Living Room"]
["km000560","13","Living Room"]
["km000560","14","2 Piece Powder Room"]
["km000560","15","Bedroom"]
["km000560","16","Bedroom"]
["km000560","17","Bedroom"]
["km000560","18","3 Piece Bathroom"]
["km000560","19","Master Bedroom"]
["km000560","20","Master Bedroom"]
["km000560","21","5 Piece Ensuite Bathroom"]
["km000560","22","Dressing Room"]
["km000560","23","Sitting Room"]
["km000560","24","Sitting Room"]
["km000560","25","Recreation Room"]
["km000560","26","Sauna"]
["km000560","27","2 Piece Powder Room"]
["km000560","28","Aerial View"]
["km000560","29","Backyard"]
["km000561","01","Front"]
["km000561","02","Front Yard"]
["km000561","03","Front Yard"]
["km000561","04","Front Yard"]
["km000561","05","Living Room"]
["km000561","06","Living Room"]
["km000561","07","Living Room"]
["km000561","08","Living Room"]
["km000561","09","Dining Room"]
["km000561","10","Dining Room"]
["km000561","11","Kitchen"]
["km000561","12","Kitchen"]
["km000561","13","Bedroom"]
["km000561","14","Bedroom"]
["km000561","15","Bedroom"]
["km000561","16","3 Piece Bathroom"]
["km000561","17","Family Room"]
["km000561","18","Family Room"]
["km000561","19","Family Room"]
["km000561","20","Lower Level"]
["km000561","21","Office"]
["km000561","22","Backyard"]
["km000561","23","Backyard"]
["km000561","24","Backyard"]
["km000561","25","Backyard"]
["km000566","01","Front"]
["km000566","02","Front"]
["km000566","03","Backyard"]
["km000566","04","Backyard"]
["km000566","05","Living Room"]
["km000566","06","Living Room"]
["km000566","07","Dining Room"]
["km000566","08","Dining Room"]
["km000566","09","Kitchen"]
["km000566","10","Kitchen"]
["km000566","11","Kitchen"]
["km000566","12","2 Piece Powder Room"]
["km000566","13","Bedroom"]
["km000566","14","Bedroom"]
["km000566","15","Bedroom"]
["km000566","16","Bedroom"]
["km000566","17","4 Piece Bathroom"]
["km000562","01","Front"]
["km000562","02","View from Suite"]
["km000562","03","View from Suite"]
["km000562","04","View from Suite"]
["km000562","05","Living Room"]
["km000562","06","Living & Dining Room"]
["km000562","07","Living Room"]
["km000562","08","Dining Room"]
["km000562","09","Solarium"]
["km000562","10","Kitchen"]
["km000562","11","Breakfast Area"]
["km000562","12","Master Bedroom"]
["km000562","13","4 Piece Bathroom"]
["km000562","14","Bedroom"]
["km000562","15","Bedroom"]
["km000562","16","2 Piece Powder Room"]
["km000565","01","Front"]
["km000565","02","Front Entrance"]
["km000565","03","Backyard"]
["km000565","04","Backyard"]
["km000565","05","Backyard"]
["km000565","06","Backyard"]
["km000565","07","Backyard"]
["km000565","08","Foyer"]
["km000565","09","Foyer"]
["km000565","10","Living Room"]
["km000565","11","Living Room"]
["km000565","12","Living Room"]
["km000565","13","Dining Room"]
["km000565","14","Kitchen"]
["km000565","15","Kitchen"]
["km000565","16","Kitchen"]
["km000565","17","Breakfast Area"]
["km000565","18","Breakfast Area"]
["km000565","19","Family Room"]
["km000565","20","Family Room"]
["km000565","21","2 Piece Powder Room"]
["km000565","22","Upper Landing"]
["km000565","23","Master Bedroom"]
["km000565","24","Master Bedroom"]
["km000565","25","3 Piece Ensuite Bathroom"]
["km000565","26","Bedroom"]
["km000565","27","Bedroom"]
["km000565","28","Bedroom"]
["km000565","29","4 Piece Bathroom"]
["km000565","30","4 Piece Bathroom"]
["km000565","31","Lower Landing"]
["km000565","32","Recreation Room"]
["km000565","33","Recreation Room"]
["km000565","34","3 Piece Ensuite Bathroom"]
["km000565","35","Bedroom"]
["km000567","01","Front"]
["km000567","02","Backyard"]
["km000567","03","Backyard"]
["km000567","04","Backyard"]
["km000567","05","Backyard"]
["km000567","06","Backyard"]
["km000567","07","Front Exterior"]
["km000567","08","Foyer"]
["km000567","09","Foyer"]
["km000567","10","Formal Living Room"]
["km000567","11","Formal Living Room"]
["km000567","12","Formal Living Room"]
["km000567","13","Formal Dining Room"]
["km000567","14","Formal Dining Room"]
["km000567","15","Formal Dining Room"]
["km000567","16","Kitchen"]
["km000567","17","Kitchen"]
["km000567","18","Kitchen"]
["km000567","19","Kitchen"]
["km000567","20","Morning Room"]
["km000567","21","Morning Room"]
["km000567","22","Family Room"]
["km000567","23","Family Room"]
["km000567","24","Family Room"]
["km000567","25","Family Room"]
["km000567","26","Family Room"]
["km000567","27","2 Piece Powder Room"]
["km000567","28","Side Entrance Foyer/Elevator"]
["km000567","29","Side Entrance Mud Room"]
["km000567","30","Side Entrance Mud Room"]
["km000567","31","Library"]
["km000567","32","Library"]
["km000567","33","Upper Landing"]
["km000567","34","Master Bedroom"]
["km000567","35","Master Bedroom"]
["km000567","36","Sitting Room"]
["km000567","37","5 Piece Master Ensuite Bathroom"]
["km000567","38","5 Piece Master Ensuite Bathroom"]
["km000567","39","5 Piece Master Ensuite Bathroom"]
["km000567","40","Loft/Office"]
["km000567","41","Loft/Office"]
["km000567","42","Loft/Office"]
["km000567","43","Spiral Staircase"]
["km000567","44","Bedroom"]
["km000567","45","Bedroom"]
["km000567","46","3 Piece Ensuite Bathroom"]
["km000567","47","Bedroom"]
["km000567","48","3 Piece Ensuite Bathroom"]
["km000567","49","4 Piece Ensuite Bathroom"]
["km000567","50","Recreation Room"]
["km000567","51","Games Room"]
["km000567","52","Games Room"]
["km000567","53","Studio Room"]
["km000567","54","Music/Theatre Room"]
["km000567","55","Exercise Room"]
["km000567","56","3 Piece Enuiste Spa Bathroom"]
["km000567","57","Guest/Nanny Suite"]
["km000567","58","3 Piece Ensuite Bathroom"]
["km000567","59","Wine Cellar"]
["km000563","01","Front"]
["km000563","02","Front Exterior"]
["km000563","03","Front Exterior"]
["km000563","04","Backyard"]
["km000563","05","Backyard"]
["km000563","06","Backyard"]
["km000563","07","Backyard"]
["km000563","08","Backyard"]
["km000563","09","Backyard"]
["km000563","10","Family Room"]
["km000563","11","Breakfast Area"]
["km000563","12","Breakfast Area"]
["km000563","13","Kitchen"]
["km000563","14","Kitchen"]
["km000563","15","Kitchen"]
["km000563","16","Living Room"]
["km000563","17","Living Room"]
["km000563","18","Dining Room"]
["km000563","19","2 Piece Powder Room"]
["km000563","20","Master Bedroom"]
["km000563","21","3 Piece Ensuite Bathroom"]
["km000563","22","Bedroom"]
["km000563","23","Bedroom"]
["km000563","24","Bedroom"]
["km000563","25","4 Piece Spa Bathroom"]
["km000563","26","4 Piece Spa Bathroom"]
["km000563","27","Recreation Room"]
["km000563","28","Recreation Room"]
["km000563","29","Office"]
["km000563","30","Office"]
["km000563","31","Exercise Room"]
["km000568","01","Front"]
["km000568","02","Backyard"]
["km000568","03","Backyard"]
["km000568","04","Backyard"]
["km000568","05","Backyard"]
["km000568","06","Backyard"]
["km000568","07","Private Stairway to Golf Course & Viewing Area"]
["km000568","08","Private Stairway to Golf Course & Viewing Area"]
["km000568","09","Golf Course Viewing Area"]
["km000568","10","Donalda Golf Course"]
["km000568","11","Foyer"]
["km000568","12","Living Room"]
["km000568","13","Living Room"]
["km000568","14","Living Room"]
["km000568","15","Living Room"]
["km000568","16","Kitchen"]
["km000568","17","Kitchen"]
["km000568","18","Kitchen"]
["km000568","19","Kitchen"]
["km000568","20","Breakfast Area"]
["km000568","21","Dining Room"]
["km000568","22","Upper Level & Terrerium"]
["km000568","23","Master Bedroom"]
["km000568","24","4 Piece Ensuite Bathroom"]
["km000568","25","Bedroom"]
["km000568","26","Bedroom"]
["km000568","27","4 Piece Bathroom"]
["km000568","28","Family Room"]
["km000568","29","Family Room"]
["km000568","30","Great Room"]
["km000568","31","Great Room"]
["km000568","32","Office/Bedroom"]
["km000568","33","2 Piece Powder Room"]
["km000564","01","Front"]
["km000564","02","Front"]
["km000564","03","Front"]
["km000564","04","Front Exterior"]
["km000564","05","Backyard"]
["km000564","06","Backyard"]
["km000564","07","Backyard"]
["km000564","08","Backyard"]
["km000564","09","Backyard"]
["km000564","10","Backyard"]
["km000564","11","Backyard"]
["km000564","12","Foyer"]
["km000564","13","Dining Room"]
["km000564","14","Kitchen"]
["km000564","15","Kitchen"]
["km000564","16","Living Room"]
["km000564","17","Living Room"]
["km000564","18","Master Bedroom"]
["km000564","19","Master Bedroom"]
["km000564","20","4 Piece Ensuite Bathroom"]
["km000564","21","Bedroom"]
["km000564","22","Sitting Area"]
["km000564","23","3 Piece Ensuite Bathroom"]
["km000564","24","Bedroom"]
["km000564","25","4 Piece Bathroom"]
["km000564","26","Multi Purpose Room"]
["km000564","27","Bedroom"]
["km000564","28","Games Room"]
["km000564","29","Bedroom"]
["km000564","30","2 Piece Powder Room"]
["km000564","31","Recreation Room"]
["km000564","32","Recreation Room"]
["km000564","33","Office"]
["km000564","34","Office"]
["km000564","35","Backyard Aerial"]
["km000569","01","Front"]
["km000569","02","Backyard"]
["km000569","03","Backyard"]
["km000569","04","Backyard"]
["km000569","05","Backyard"]
["km000569","06","Backyard"]
["km000569","07","Backyard"]
["km000569","08","Backyard"]
["km000569","09","Backyard"]
["km000569","10","Foyer"]
["km000569","11","Living Room"]
["km000569","12","Dining Room"]
["km000569","13","Kitchen"]
["km000569","14","Kitchen"]
["km000569","15","Kitchen"]
["km000569","16","Master Bedroom"]
["km000569","17","3 Piece Ensuite Bathroom"]
["km000569","18","Bedroom"]
["km000569","19","Bedroom"]
["km000569","20","3 Piece Bathroom"]
["km000569","21","Recreation Room"]
["km000569","22","Recreation Room"]
["km000569","23","Bar"]
["km000569","24","Den/Office"]
["km000569","25","Bedroom"]
["km000569","26","Sauna"]
["km000569","27","3 Piece Bathroom"]
["km000571","01","Front"]
["km000571","02","Backyard"]
["km000571","03","Living Room"]
["km000571","04","Living Room"]
["km000571","05","Living Room"]
["km000571","06","Dining Room"]
["km000571","07","Kitchen"]
["km000571","08","Breakfast Area"]
["km000571","09","Family Room"]
["km000571","10","Family Room"]
["km000571","11","Master Bedroom"]
["km000571","12","4 Piece Ensuite Bathroom"]
["km000571","13","Bedroom"]
["km000571","14","Bedroom"]
["km000571","15","Bedroom"]
["km000571","16","5 Piece Bathroom"]
["km000571","17","Recreation & Games Room"]
["km000571","18","Recreation Room"]
["km000571","19","Games Room"]
["km000572","01","Front"]
["km000572","02","Backyard"]
["km000572","03","Backyard"]
["km000572","04","Kitchen"]
["km000572","05","Kitchen"]
["km000572","06","Kitchen"]
["km000572","07","Kitchen"]
["km000572","08","Balcony"]
["km000572","09","Kitchen"]
["km000572","10","Dining Room"]
["km000572","11","Dining & Living Room"]
["km000572","12","Dining Room"]
["km000572","13","Living Room"]
["km000572","14","Living Room"]
["km000572","15","Bedroom"]
["km000572","16","3 Piece Ensuite Bathroom"]
["km000572","17","Bedroom"]
["km000572","18","4 Piece Ensuite Bathroom"]
["km000572","19","Bedroom"]
["km000572","20","4 Piece Bathroom"]
["km000572","21","Recreation Room"]
["km000572","22","Recreation Room"]
["km000572","23","2 Piece Powder Room"]
["km000574","01","Front"]
["km000574","02","Backyard"]
["km000574","03","Backyard"]
["km000574","04","Living Room"]
["km000574","05","Living Room"]
["km000574","06","Dining Room"]
["km000574","07","Kitchen"]
["km000574","08","Master Bedroom"]
["km000574","09","Bedroom"]
["km000574","10","4 Piece Bathroom"]
["km000570","01","Front"]
["km000570","02","Front Exterior"]
["km000570","03","Backyard"]
["km000570","04","Backyard"]
["km000570","05","Backyard"]
["km000570","06","Backyard"]
["km000570","07","Backyard"]
["km000570","08","Kitchen"]
["km000570","09","Kitchen"]
["km000570","10","Kitchen"]
["km000570","11","Kitchen"]
["km000570","12","Breakfast Area"]
["km000570","13","Dining Room"]
["km000570","14","Dining Room"]
["km000570","15","Living Room"]
["km000570","16","Living Room"]
["km000570","17","Living Room"]
["km000570","18","Den"]
["km000570","19","Office"]
["km000570","20","Master Bedroom"]
["km000570","21","Master Bedroom"]
["km000570","22","Master Bedroom Loft"]
["km000570","23","Master Bedroom Loft"]
["km000570","24","Master Bedroom"]
["km000570","25","Master Bedroom Loft"]
["km000570","26","Master Bedroom Loft"]
["km000570","27","4 Piece Bathroom"]
["km000570","28","4 Piece Bathroom"]
["km000570","29","Bedroom"]
["km000570","30","4 Piece Bathroom"]
["km000570","31","Recreation Room"]
["km000570","32","Recreation Room"]
["km000570","33","Recreation Room"]
["km000570","34","Games Room"]
["km000573","01","Front"]
["km000573","02","Backyard"]
["km000573","03","Living Room"]
["km000573","04","Living Room"]
["km000573","05","Dining Room"]
["km000573","06","Kitchen"]
["km000573","07","Kitchen"]
["km000573","08","Master Bedroom"]
["km000573","09","Bedroom"]
["km000573","10","Bedroom"]
["km000573","11","4 Piece Bathroom"]
["km000573","12","Recreation Room"]
["km000573","13","Recreation Room"]
["km000573","14","Bedroom"]
["km000573","15","Laundry Room"]
["km000573","16","3 Piece Bathroom"]
["km000573","17","3 Piece Bathroom"]
["km000577","01","Front"]
["km000577","02","Kitchen"]
["km000577","03","Kitchen"]
["km000577","04","Kitchen"]
["km000577","05","Living Room"]
["km000577","06","Living Room"]
["km000577","07","Living Room"]
["km000577","08","Dining Room"]
["km000577","09","Bedroom"]
["km000577","10","4 Piece Bathroom"]
["km000577","11","Terrace"]
["km000577","12","Terrace"]
["km000577","13","Terrace"]
["km000577","14","Lobby"]
["km000577","15","Pool & Hot Tub"]
["km000577","16","Exercise Room"]
["km000577","17","Theatre Room"]
["km000577","18","Bbq Terrace"]
["km000578","01","Front"]
["km000578","02","Complex Entrance"]
["km000578","03","Backyard"]
["km000578","04","Backyard"]
["km000578","05","Foyer"]
["km000578","06","Living Room"]
["km000578","07","Living Room"]
["km000578","08","Living & Dining Room"]
["km000578","09","Dining Room"]
["km000578","10","Kitchen"]
["km000578","11","Kitchen"]
["km000578","12","Kitchen"]
["km000578","13","Staircase to Upper Level"]
["km000578","14","Master Bedroom"]
["km000578","15","Bedroom"]
["km000578","16","Bedroom"]
["km000578","17","4 Piece Bathroom"]
["km000578","18","Office"]
["km000578","19","Bedroom"]
["km000580","01","Front"]
["km000580","02","Living Room"]
["km000580","03","Living Room"]
["km000580","04","Living Room"]
["km000580","05","Living Room"]
["km000580","06","Living Room"]
["km000580","07","Staircase to Lower Level"]
["km000580","08","Dining Room"]
["km000580","09","Dining Room"]
["km000580","10","Kitchen"]
["km000580","11","4 Piece Bathroom"]
["km000580","12","Bedroom"]
["km000580","13","Balcony"]
["km000580","14","Bedroom"]
["km000580","15","Master Bedroom Loft"]
["km000580","16","Master Bedroom Loft"]
["km000580","17","3 Piece Ensuite Bathroom"]
["km000580","18","3 Piece Ensuite Bathroom"]
["km000580","19","Park"]
["km000580","20","Park"]
["km000579","01","Front"]
["km000579","02","Living Room"]
["km000579","03","Dining Room"]
["km000579","04","Living & Dining Room"]
["km000579","05","Kitchen"]
["km000579","06","Kitchen"]
["km000579","07","Bedroom"]
["km000579","08","Bedroom"]
["km000579","09","4 Piece Bathroom"]
["km000579","10","Laundry Closet"]
["km000579","11","Balcony"]
["km000579","12","Balcony"]
["km000579","13","Tennis Court"]
["km000579","14","Park"]
["km000579","15","Outdoor Pool"]
["km000579","16","Outdoor Pool"]
["km000581","01","Front"]
["km000581","02","Front Exterior"]
["km000581","03","Front Exterior"]
["km000581","04","Backyard"]
["km000581","05","Backyard"]
["km000581","06","Backyard"]
["km000581","07","Foyer"]
["km000581","08","Dining Room"]
["km000581","09","Dining Room"]
["km000581","10","Family Room"]
["km000581","11","Family Room"]
["km000581","12","Kitchen"]
["km000581","13","Kitchen"]
["km000581","14","Kitchen"]
["km000581","15","Kitchen"]
["km000581","16","Breakfast Area"]
["km000581","17","Den"]
["km000581","18","4 Piece Bathroom"]
["km000581","19","Master Bedroom"]
["km000581","20","Master Bedroom"]
["km000581","21","6 Piece Ensuite Bathroom"]
["km000581","22","6 Piece Ensuite Bathroom"]
["km000581","23","6 Piece Ensuite Bathroom"]
["km000581","24","Bedroom 2"]
["km000581","25","Bedroom 2"]
["km000581","26","Bedroom 3"]
["km000581","27","Bedroom 3"]
["km000581","28","4 Piece Bathroom"]
["km000581","29","Recreation Room"]
["km000581","30","Recreation Room"]
["km000581","31","Exercise Room"]
["km000581","32","Exercise Room"]
["km000581","33","Bedroom"]
["km000581","34","3 Piece Bathroom"]
["km000582","01","Front"]
["km000582","02","Living Room"]
["km000582","03","Living Room & Kitchen"]
["km000582","04","Kitchen & Living Room"]
["km000582","05","Kitchen"]
["km000582","06","Kitchen"]
["km000582","07","Kitchen"]
["km000582","08","Kitchen"]
["km000582","09","Kitchen"]
["km000582","10","4 Piece Bathroom"]
["km000582","11","2nd Level Bedroom"]
["km000582","12","2nd Level Bedroom"]
["km000582","13","3rd Level Den"]
["km000582","14","3rd Level Den"]
["km000582","15","3rd Level Master Bedroom"]
["km000582","16","3rd Level Master Bedroom"]
["km000582","17","3 Piece Ensuite Bathroom"]
["km000582","18","4th Level Terrace"]
["km000582","19","Recreation Room"]
["km000582","20","2 Piece Powder Room"]
["km000582","21","Laundry Room"]

{"sheet":"Business Rules","index":7,"n_rows":48,"n_cols":2,"rows_kept":48,"cut":false,"hidden":true,"merged":[]}
["HOME TYPE MAPPING"]
[]
["XML.type","kmillar.com display"]
["Luxury","Luxury"]
["Executive","Executive"]
["Family","Family Residential"]
["Condo","Condo"]
["Reno","Renovator"]
["First","First Time Buyer"]
[]
[]
["USED ATTRIBUTES"]
[]
["XML.type != Condo","XML.type = Condo"]
["property_id","property_id"]
["status","status"]
["type","type"]
["address","address"]
["price","price"]
["description","description"]
["description2","description2"]
["area","area"]
["lat","lat"]
["lng","lng"]
["virtual_tour","virtual_tour"]
["lot"]
["taxes","taxes"]
["bedrooms","bedrooms"]
["parking","parking"]
["bathrooms","bathrooms"]
[null,"maintenance"]
[null,"locker"]
["possession","possession"]
["features01","features01"]
["features02","features02"]
["features03","features03"]
["features04","features04"]
["features05","features05"]
["features06","features06"]
["features07","features07"]
["features08","features08"]
["features09","features09"]
["features10","features10"]
["features11","features11"]
["features12","features12"]
["features13","features13"]
["features14","features14"]
["features15","features15"]