{"text_format":"1","workbook":"xlsx","n_sheets":8,"sheets":["Listings","News","Tips","Trades","Testimonials","Lookups","Slides","Business Rules"],"not_rendered":{"charts":0,"images":61,"macros":1,"external_links":2,"defined_names":15,"comments":0,"pivot_tables":0},"unopened":[],"bounds":{"document_bytes":16777216,"sheet_cells":100000,"rows_first":2000,"rows_last":500,"rows_between":2000,"halvings":0,"cell_chars":16384,"cell_head_chars":4096},"cells_cut":0,"cells_raw":0,"read":"row_number_cap","date_system":"1900"}

{"sheet":"Listings","index":0,"n_rows":522,"n_cols":81,"rows_kept":522,"cut":false,"hidden":false,"merged":[]}
["Karen Millar Listings"]
[]
["property_id","status","type","address_num","address","price","lease_price","description","description2","area","lat_calc","lng_calc","lat","lng","virtual_tour","open_house","video","videomain","lot","taxes","bedrooms","parking","bathrooms","maintenance","locker","possession","Elementary","Intermediate","Secondary","features01","features02","features03","features04","features05","features06","features07","features08","features09","features10","features11","features12","features13","features14","features15","features16","features17","features18","features19","features20","features21","features22"]
["km000001","ARCHIVE","Luxury",7,"Sulkara Ct.",998800,null,"Stunning Bungalow! Renovated & Backs Ravine!","This Family Home Will Wow You!","VICTORIA VILLAGE",null,null,43.732424999999999,-79.323280999999994,"http://tours.advirtours.com/tours/10/54/105456/uindex.html",null,null,null,"60 X 183.8","$5,142.65/2007","2+2","Double Car Garage + 4 Car Parking","1x4, 2x3,1x2 PC",null,null,"90 Days or TBA",null,null,null,"200 Amp Service","Central Vacuum","Roof 2003","Furnace  1999","Central Air Conditioning 1999","Backs on to Ravine","EXTERIOR ","4 car parking","Interlocking stone driveway","Double car garage","Professionally landscaped","Roughed-in plumbing for fountain in back garden","Interlocking stone patio","Feng Shui calming area"]
["km000002","ARCHIVE","Luxury",139,"Anndale Dr.",979900,null,"Gorgeous 3 Year New Home!","Steps to Bayview & Yonge Shopping, TTC & Parks!","BAYVIEW/SHEPPARD",null,null,43.762481000000001,-79.398557999999994,"http://tours.advirtours.com/tours/10/54/105478/uindex.html",null,null,null,"45 x 138 Irregular","$7,530.60/2007","4 + 1","Double Car Garage + 2 Car Parking","2 x 6, 1 x 4, 1 x 3,2 x 2 PC",null,null,"90 Days or TBA",null,null,null,"200 Amps Circuit Breakers","Top of the Line Appliances","Underground Sprinkler System","Main Floor Solarium, Family Room & Laundry","Central Vacuum","Central Air Conditioning","200 Amp Service","Brazilian Cherrywood Trim","3 Walk-outs from Lower Level","EXTERIOR ","Professionally landscaped","2 car parking","Double car garage","Inground pool","Interlocking brick patio","Private pool area","Fully fenced backyard"]
["km000003","ARCHIVE","Family Residential",67,"Cassandra Blvd.",549900,null,"Executive Family Home Steps to Everything!!","Hardwood Flooring, Family Sized Eat-in Kitchen & Finished Lower Level!","LAWRENCE/UNDERHILL",null,null,43.747697000000002,-79.331478000000004,null,null,null,null,"85.52 x 111 FT","$3,982.77/2007","3+1","Double Car Garage + 2 Car Parking","1x4, 2x3",null,null,"90 Days or TBA",null,null,null,"100 Amp Service","New Roof","Updated Bathrooms","Finished Lower level","Mostly Updated Windows","Exterior","2 car parking","Double car garage","Large front verandah","In-ground pool","Wooden deck","Two Sheds","Fully fenced"]
["km000004","ARCHIVE","Family Residential",87,"Duncairn",419900,null,"Rare Private Garden Backing Greenbelt!","Sought After Neighbourhood! Steps to New Shops at Don Mills!","DON MILLS/LAWRENCE",null,null,43.741028,-79.351382999999998,null,null,null,null,"35 x 120 FT","$2,703.51/2007",3,"3 Car Parking","1x4, 1x 3",null,null,"90-120 Days or TBA",null,null,null,"Backs Greenbelt","100 Amp Service","Central Air Conditioning ‘01’","Furnace ‘01’","Hardwood Flooring Throughout","Steps to TTC & DVP","EXTERIOR","3 car parking","Mature trees and shrubs in front and back yards","Aluminum soffit and fascia","Interlocking brick patio in back garden","Wooden deck","Fully fenced back garden","Access to walking trails"]
["km000005","ARCHIVE","Executive",50,"Doonaree",729900,null,"Gorgeous & Updated From Top to Bottom!","New Gourmet Kitchen Overlooks Ravine!","LAWRENCE/UNDERHILL",null,null,43.745286,-79.329047000000003,"http://tours.advirtours.com/tours/10/65/106575/uindex.html",null,null,null,"85 X 120 FT","$4,315.59/2007","3+2","Attached Double Garage + 6 Car Parking","2x4,1x2 PC",null,null,"90 Days or TBA",null,null,null,"Ravine Lot","200 Amp Service","Viessman Boiler & Hi Efficiency Water Heat ‘05’","Eavestrophs, Soffits & Gutter Guards ‘05’","Insulation in Roof ‘07’","Main Chimney Re-Built ‘07’","Central Air Conditioning Space Pack & Air Lines‘07’","Kitchen ‘07’","Trim & Doors ‘02’","2.5 New bathrooms","2 Fireplaces","Large Raised Wooden Deck Overlooking Ravine. Very Private in Summer & Fall","Landscaping ‘03’"]
["km000006","ARCHIVE","Renovator",29,"Queen Victoria",399900,null,"Come and See 'The Pocket'","Needs a Little Tender Care!","JONES/DANFORTH",null,null,43.677114000000003,-79.334947,null,null,null,null,"14.75 x 100 Feet","$2,822.19/2007",3,"1 Lane Parking Spot","2x4",null,null,"30 Days or TBA"]
["km000007","ARCHIVE","Executive",21,"Shamokin",739900,null,"Beautifully Updated & Super Spacious!","Addition on Top & Lower Level! Private Back Garden!","DON MILLS/YORK MILLS",null,null,43.759897000000002,-79.343988999999993,"http://tours.advirtours.com/tours/10/69/106916/",null,null,null,"62.5 X 120 FT","$4,144.88/2007",3,"Attached Double Garage + 2 Car Parking","1x5, 1x3, 1x2 PC",null,null,"May 2008 or TBA",null,null,null,"New Kitchen","Updated Bathrooms","100 Amp Service","Updated Windows","Main Floor Family Room Addition","Roof ‘96’","Aluminum Soffits & Fascia","Furnace ‘94’","Central Air Conditioning ‘94’","EXTERIOR","4 car parking","Double car garage","Interlocking brick front pathway and patio","Wood deck with built-in seating","Fully fenced","Mature trees and shrubs"]
["km000008","ARCHIVE","Family Residential",124,"Church",599900,null,"Super Spacious & Steps to Yonge Street!!","Hardwood Under Broadloom! 2 Main Floor Walk-outs!","YONGE/WILLOWDALE",null,null,43.775578000000003,-79.405985999999999,null,null,null,null,"50 x 136 FT","$3,948.66/2007","3+1","Single Car Garage + 4 Car Parking","1x4, 1x2",null,null,"May 2008/TBA",null,null,null,"Roof ‘07’","100 Amp Service","Hardwood Flooring Throughout","Two Fireplaces","Two Main Floor Walk-outs","In Your Neighbourhood","Steps to Yonge Street Shopping & All Amenities","Steps to Yonge Subway Line & TTC","Mitchell Field Park, Community Centre & Arena","Earl Haig Secondary School","Willowdale Middle School","EXTERIOR","4 car parking","Single car garage","Interlocking brick front walkway","Professionally landscaped front & back yards","Garden shed","Fully fenced back yard"]
["km000009","ARCHIVE","Family Residential",36,"Lynvalley",365500,null,"Updated Beauty Close to All Amenities!","Finished Lower Level with Nanny Suite!","VICTORIA PARK/LAWRENCE",null,null,43.749003000000002,-79.309669,null,null,null,null,"40 x 146 FT","$2,430.60/2007","3+1","6 Car Parking","2x4",null,null,"May 2008/TBA",null,null,null,"Updated Windows","New Kitchen","New Bathrooms","New 100 Amp Service","Central Vacuum","Hardwood Flooring Throughout","Wireless Internet Throughout","New Trim & Baseboard’s Throughout","Renovated Lower Level","Nanny Suite","EXTERIOR","6 car parking","Large front veranda","Custom garden house with wood stove & electricity","Gas hookup for BBQ"]
["km000010","ARCHIVE","Family Residential",16,"Preakness",698800,null,"Gorgeous & Spacious in the Heart of Don Mills!","Beautiful Hardwood On Main Level!","LESLIE/YORK MILLS",null,null,43.744725000000003,-79.355380999999994,null,null,null,null,"28.54 x 86.29 FT","$4,247.16/2007",3,"Double Car Garage + 2 Car Parking","1x5, 1x4, 1x2",null,null,"90 Days or TBA",null,null,null,"New Home Built in 2005","100 Amp Service","Central Air Conditioning","Central Vacuum Smart Wiring For Cable, Internet & Telephone","Stainless Steel Appliances","Walk-out Family Size Kitchen","Fully Fenced Private Back Garden","Finished Lower Level","In Your Neighbourhood","Dunlace Public School","Denlow Public School","Rippleton Public School","Windfields Junior High School","York Mills Collegiate Institute","St. Bonadventure Catholic School","GO Station","Don Mills or York Mills Subway Line","Leslie Street Bus","Highway 401 & DVP","Shops at Don Mills – Fall 2008","York Mills Garden Plaza","Bayview Village Shopping Centre","Fairview Mall","Edwards Gardens","Bond Park","North York General Hospital"]
["km000011","ARCHIVE","Family Residential",154,"Three Valleys Drive",419900,null,"Great Potential in this Spacious Bungalow!","Ravine Property! Finished Lower Level with Seperate Entrance!","YORK MILLS/DON MILLS",null,null,43.745838999999997,-79.336996999999997,null,null,null,null,"36 x 123 FEET","$3,317.56/2007","4+1","3 Car Parking","1 X 4, 1 X3 PC",null,null,"IMMEDIATE/TBA",null,null,null,"Ravine Property","Roof ‘03’","100 Amp Service","Furnace ‘97’","Central Air Conditioning ‘97’","Hardwood Flooring Throughout","Mostly Updated Windows","Exterior","3 car parking","2 Garden sheds","Mature trees and shrubs","Backs on to ravine"]
["km000012","ARCHIVE","Condo",18,"Concorde #727",399900,null,"Wonderful 1680 sq.ft. Low Rise Condo Surrounded by Nature!!","Rare Model with Seperate Dining Room & Den!","CONCORDE/DVP",null,null,43.730097000000001,-79.328433000000004,null,null,null,null,null,"$3,019.07 / 2007",2,"2 underground spots","1 x 3, 1 X 5","$1,095.53 includes heat, cable, building insurance, common elements, water, hydro, central air conditioning and parking","1 Double size","Immediate",null,null,null,"FOYER ","Double mirrored closet","Marble flooring","Crown moulding","KITCHEN ","Ceramic tile backsplash","Pot lights","Ceramic tile flooring","Double sink","Garborator","Built-in dishwasher","Walkout to balcony","Built-in fridge","Sliding door to den","Kitchen bar","LIVING ROOM ","Oak hardwood flooring","Gas fireplace with marble surround","Walkout to balcony/ravine views","Separate thermostat","Crown moulding","DINING ROOM ","French doors","Oak hardwood floors","Wainscoting","Swing door to kitchen","Overlooks ravine","Crown moulding","MASTER ","Walk-in closet with built in shelving","Broadloom","Overlooks ravine","Ceiling fan","California shutters","Separate thermostat","5 PIECE ENSUITE BATHROOM","His and Her sinks","Whirlpool tub","Marble flooring and walls","Heat light","AMENITIES","Pool","Exercise room","Library","Party Room/Concorde Room","Card Room","Billiard Room","Spa/Hot Tub","Tennis Court","Putting Green","Car Wash Bay","Sun Deck"]
{"$rows_left_out":508}
{"sheet":"News","index":1,"n_rows":142,"n_cols":7,"rows_kept":142,"cut":false,"hidden":false,"merged":[]}
["Karen Millar News"]
[]
["news_id","type","title","filename","author","source","date"]
["kmnw0001","ECO","Royal LePage Eco Podcast","http://media.bluerush.ca/royallepage/podcast5en/rl_episode_5.html","Royal LePage"]
["kmnw0002","ECO","How Green is your Home?","How_green_is_your_home.pdf","Kathryn Young","CanWest News Service","July 27, 2008"]
["kmnw0003","ECO","Cash In, Turn Out, Drop Off!","Cash_in_turn_out_drop_off.pdf","Andrew Willis","Globe and Mail","April 4, 2008"]
["kmnw0004","ECO","Ten Novel Ways to go Green on Earth Day","10_Novel_Ways_to_go_Green_for_Earth_Day.pdf","Nicole Tomlinson","CTV.ca","April 20, 2008"]
["kmnw0005","ECO","Be a Good Steward","Be_a_Good_Steward.pdf","Matthew Sleeth"]
["kmnw0006","ECO","Consumers Cautiously Keen About Green","Consumers_Cautiously_Keen_About_Green.pdf","Tyler Hamilton",null,"January 20, 2009"]
["kmnw0007","ECO","Ed Begley Acts on his Eco Beliefs","Ed_Begley_Act_on_his_Eco-Beliefs.pdf","Elizabeth Weise","USA Today"]
["kmnw0008","ECO","Have yourself a Green Christmas","Have_Yourself_a_Green_Christmas.pdf","Jim Ball"]
["kmnw0009","ECO","Keeping Green over the Holiday Season","Keeping_Green_Over_the_Holiday_Season.pdf","Sandie Benitah","CTV.ca","December 24, 2007"]
["kmnw0010","ECO","Thornhill Condo will be Green Inside and Out","Thornhill_Condo_Will_be_Green_Inside_and_Out.pdf","Diane Tierney","Toronto Star","January 10, 2009"]
["kmnw0011","ECO","Bill 150 Targets Long-Suffering Homeowner","Bill_150.pdf","Bob Aaron","Yourhome.ca","March 7, 2009"]
["kmnw0012","ECO","Green audits have critics seeing red","Green_Audits.pdf","Rob Ferguson","Yourhome.ca","February 25, 2009"]
{"$rows_left_out":128}
{"sheet":"Tips","index":2,"n_rows":202,"n_cols":4,"rows_kept":202,"cut":false,"hidden":false,"merged":[]}
["Karen Millar Tips"]
[]
["tips_id","type","text","length"]
["kmtp0001","ECO","Sensors turn lights on when motion is sensed, making them great for storerooms, basements and entrances, reducing lighting consumption up to 30%.  Businesses find sensor lights most helpful in storage and loading\nareas when you might not have a hand free to turn on the lights.",{"$f":"LEN(C4)","v":277}]
["kmtp0002","ECO","Programmable thermostats are easy to install and can reduce your heating and cooling bills up to 10% a year. Programmable thermostats are easily available at hardware stores and cost under $100.",194]
["kmtp0003","ECO","Trees purify the air in addition to providing shade in the summer and shelter from cold winter winds. Visit your local garden centre to find out which trees would suit your site.",178]
["kmtp0004","ECO","Reversible ceiling fans push down hot air in winter and ventilate in summer by pulling hot air up.  A ceiling fan can lower the temperature by about 2 degrees Celsius. They're especially well-sited to rooms with high ceilings.",226]
["kmtp0005","ECO","Shades, drapes and interior shutters help reduce heat loss at night and can block sunlight during the day. Don't underestimate the impact closing your drapes or shades can have on cutting air-conditioning and heating bills.",223]
["kmtp0006","ECO","Shades, drapes and interior shutters help reduce heat loss at night and can block sunlight during the day. Don't underestimate the impact closing your drapes or shades can have on cutting air-conditioning and heating bills.",223]
["kmtp0007","ECO","Weather-strip doors; weather- stripping kits are easily available at hardware stores. Commercial (metal) doors may require specialty weather stripping.",151]
["kmtp0008","ECO","All those tiny gaps and cracks in an older building can add up to a one-foot square hole. You can save up to 40% on heating and cooling by filling them in - its easy to do and very inexpensive.",193]
["kmtp0009","ECO","One of the easiest ways to save energy is to turn off lights and appliances when you're not using them.",103]
["kmtp0010","ECO","Timers save money both at home and in commercial buildings by automatically switching off lights at specified times.",116]
["kmtp0011","ECO","Double-paned glass in new doors and windows may cost more initially, but can reduce heating costs by 34% in cold climates and save 38% on summer cooling.",153]
["kmtp0012","ECO","Fill oddly shaped gaps with fiberglass insulation, or spray foam, which can be cut and painted after it hardens.",112]
{"$rows_left_out":188}
{"sheet":"Trades","index":3,"n_rows":186,"n_cols":13,"rows_kept":186,"cut":false,"hidden":false,"merged":[]}
["Karen Millar Trades"]
[]
["company_id","trade_id","type_type","company","contact","address_01","address_02","info_01","info_02","info_03","info_04","email","web"]
["kmtr0001","t01","Banks/Mortgages","Dominion Lending","Carolyn Dunlop - Mortgage Consultant","49 The Donway West","Toronto, ON M3C 3M9","Tel:  416-443-0300",null,"Pager:  416-609-7099","Fax:  416-386-1375"]
["kmtr0002",{"$f":"VLOOKUP(C5,Lookups!$E$2:$F$26,2,FALSE)","v":"t01"},"Banks/Mortgages","TD Bank – Residential Mortgages","Judy Maddigan - Manager",null,null,"Tel:  416-860-8292","Cell:  416-878-5839",null,null,"Judy.maddigan@td.com","www.tdcanadatrust.com/msf/judymaddigan"]
["kmtr0003",{"$f":"VLOOKUP(C6,Lookups!$E$2:$F$26,2,FALSE)","v":"t01"},"Banks/Mortgages","Tom Miocevich - Mortgage Agent",null,"8 Sampson Mews, 201","Toronto, ON M3C 0H5","Tel:  416-569-7283","Fax: 416-850-4325",null,null,"tom@tommiocevich.com","www.tommiocevich.com"]
["kmtr0004",{"$f":"VLOOKUP(C7,Lookups!$E$2:$F$26,2,FALSE)","v":"t03"},"Floors","City East",null,"Show room:  111 Industrial Drive Unit 9 & 10","Whitby, ON L1N 5Z9","Tel:  905-668-2559 or 1-800-656-9964",null,null,"Fax:  905-668-7205"]
["kmtr0005",{"$f":"VLOOKUP(C8,Lookups!$E$2:$F$26,2,FALSE)","v":"t03"},"Floors","Benchmark Carpet","Daryl","1279 Kennedy Road","Scarborough, ON M1P 2L4","Phone:  416.752.5554",null,null,"FAX:  416-752-5597"]
["kmtr0006",{"$f":"VLOOKUP(C9,Lookups!$E$2:$F$26,2,FALSE)","v":"t04"},"Foundations","Gerardo","Tel: 647-220-2716"]
["kmtr0007",{"$f":"VLOOKUP(C10,Lookups!$E$2:$F$26,2,FALSE)","v":"t05"},"Home Inspectors","Aiken Home Inspections","Scott Aiken","Tel:  416-407-4663"]
["kmtr0008",{"$f":"VLOOKUP(C11,Lookups!$E$2:$F$26,2,FALSE)","v":"t05"},"Home Inspectors","All Seasons Home Insp.","John Tackaberry","81 Ferris Road","East York, ON M4B1G5","Tel:  416-752-4663",null,null,"Fax:  416-752-0651","allseasons@rogers.com"]
["kmtr0009",{"$f":"VLOOKUP(C12,Lookups!$E$2:$F$26,2,FALSE)","v":"t05"},"Home Inspectors","Baker Street","Jeff Clarke","3335 Yonge Street, Suite 402","Toronto, Ontario, M4N 2M1","Tel:  416-483-3535",null,null,"Fax:  416-483-9756","info@bakerstreet-hi.com"]
["kmtr0010",{"$f":"VLOOKUP(C13,Lookups!$E$2:$F$26,2,FALSE)","v":"t05"},"Home Inspectors","Carson & Dunlop","David C. Kee","120 Carlton Street, Suite 407","Toronto, ON  M5A 4K2","Tel:  416-964-9415","Toll Free: 1-800-268-7070",null,"Fax:  416-964-0683","david.kee@carsondunlop.com","www.carsondunlop.com"]
["kmtr0011",{"$f":"VLOOKUP(C14,Lookups!$E$2:$F$26,2,FALSE)","v":"t05"},"Home Inspectors","Claude Michaud & Associates Inc.","Claude Michaud","180 Wheeler Avenue","Toronto, ON  M4L 3V4","Tel:  416-409-8162",null,null,"Fax:  416-686-4496","neville_michaud@rogers.com"]
["kmtr0012",{"$f":"VLOOKUP(C15,Lookups!$E$2:$F$26,2,FALSE)","v":"t05"},"Home Inspectors","Ken Haller Home Inspection Inc.","Tel:  416-465-8236"]
{"$rows_left_out":172}
{"sheet":"Testimonials","index":4,"n_rows":153,"n_cols":6,"rows_kept":153,"cut":false,"hidden":false,"merged":[]}
["Karen Millar Testimonials"]
[]
["testimonial_id","status","name","date","quote"]
["kmts0001","OFF","Laura & John","November, 2005","\"Fantastic service, great team, terrific agent. Went above and beyond the call every time. We appreciate everything you have done for us to find our dream home and to sell our previous residence\""]
["kmts0002","OFF","Bob Ewing","April, 2005","\"Hi Karen, Thank you and you team for all the work you did selling my mother's house. With my mother moving into a nursing home the prospect of selling the family home of more than 40 years was un-nerving to say the least. Your team made this much easier than I ever imagined. I can't thank Ian enough for all the work he put into the house and hauling off stuff to the dump, (more than once). This was definitely above and beyond what we expected. You, and your team were always only a phone call away when we needed reassurance.\n\nThe word “Team” is used quite freely in today's business world without giving much thought to what it truly means. Companies spend ridiculous amounts of money to send their employees on “Team Building” retreats. The Karen Millar Team actually understands and lives the “Team” philosophy. I quite often use your group as an example of teamwork within the workplace, in my own office. I only wish other companies took the same approach to Customer Service.\n\nAgain, Karen, I truly want to thank you for everything you did for us. I can't tell you how much it was appreciated.\""]
["kmts0003","OFF","Carla & Oswald","May, 2005","\"With Karen, it's all about SERVICE!!! All team members are prompt, efficient, professional and friendly. All the little extras make a big difference!\nIt was a pleasure dealing with ALL of you.\""]
["kmts0004","OFF","Lola","May, 2005","\"I was looked after like family. The Millar Team went far beyond expectations. Thank you for all of your help.\""]
["kmts0005","OFF","Rakesh & Neha","May, 2005","\"Our experience with your team was outstanding! The whole process was pleasant and we felt like you cared about our needs and concerns. Our most interaction was with John and Ian- two excellent individuals that delivered beyond our expectations! We have already recommended your team to everyone we know that is in the market to buy and sell.\""]
["kmts0006","OFF","Dale & Donald","May, 2005","\"We have already been singing your praises to everyone we talk to. You made the whole experience from beginning to end a real pleasure. Thank you so much!\""]
["kmts0007","OFF","Taline Gumushdjian ","May, 2005","\"Dear Karen, I cannot tell you how much of an enjoyable experience it has been dealing with you and every member of you “team”…Ian and Jeff. Everyone on board is genuinely interested in making an emotional move as pleasant and memorable as possible. Please accept our family's appreciation for your honest and sincere care in marketing and selling our home.\""]
["kmts0008","OFF","Louise & Mike","October, 2006","\"Karen and her team made the whole experience as stress free as possible. We would definitely recommend Karen!\""]
["kmts0009","OFF","Sheila","March, 2006","\"Karen, you always put our minds at ease! Every member of your team is kind and thoughtful and on top of all that, you love my dog! What else can we I ask for?\""]
["kmts0010","OFF","Hanna & Heder","January, 2007","\"Katrina and Ian were extremely helpful. You have an exceptionally efficient team that works well together - very professional!\""]
["kmts0011","OFF","Luis & Gina","January, 2007","\"Having been through the buying/selling process a number of times, this was by far the most positive and quickest we have ever experienced and we could not have been happier with the outcome\""]
["kmts0012","OFF","Melanie & David","February, 2007","\"After over six months of open houses on weekends, week-night viewings, obsessed MLS searches David and I are proud property owners!!!!!!!!!!! The multi-offer feeding frenzy that \"IS\" the GTA didn't kill us after all!!!!!!!!!!! A\"big up\" to our fab agent….the one, the only: Jeff Vedan who has been soooo incredibly patient. Jeff - you are a true agent and a good friend.\""]
{"$rows_left_out":139}
{"sheet":"Lookups","index":5,"n_rows":56,"n_cols":6,"rows_kept":56,"cut":false,"hidden":false,"merged":[]}
["listing_status","listing_type","news_type","tip_type","trade_type","trade_id"]
["NEW","Luxury","ECO","ECO","Banks/Mortgages","t01"]
["SOLD","Executive",null,null,"Contractors","t02"]
["ARCHIVE","Family Residential",null,null,"Floors","t03"]
["OFFLINE","Condo",null,null,"Foundations","t04"]
["LEASE","Renovator",null,null,"Home Inspectors","t05"]
[null,"First Time Buyer",null,null,"Junk Removal","t06"]
[null,null,null,null,"Labour","t07"]
[null,null,null,null,"Lawyers","t08"]
[null,null,null,null,"Mold","t09"]
[null,null,null,null,"Movers","t10"]
[null,null,null,null,"Oil Tank Removal","t11"]
[null,null,null,null,"Painters","t12"]
[null,null,null,null,"Pest Control","t13"]
[null,null,null,null,"Piano Mover","t14"]
{"$rows_left_out":42}
{"sheet":"Slides","index":6,"n_rows":4173,"n_cols":3,"rows_kept":4173,"cut":false,"hidden":false,"merged":[],"read":"row_number_cap"}
["Karen Millar Tips"]
[]
["property_id","pic_id","caption"]
["km000337","01","Front"]
["km000337","02","Foyer"]
["km000337","03","Foyer"]
["km000337","04","Foyer"]
["km000337","05","Foyer"]
["km000337","06","Living Room"]
["km000337","07","Living Room"]
["km000337","08","Living Room"]
["km000337","09","Dining Room"]
["km000337","10","Dining Room"]
["km000337","11","Kitchen"]
["km000337","12","Kitchen"]
{"$rows_left_out":4159}
{"sheet":"Business Rules","index":7,"n_rows":48,"n_cols":2,"rows_kept":48,"cut":false,"hidden":true,"merged":[]}
["HOME TYPE MAPPING"]
[]
["XML.type","kmillar.com display"]
["Luxury","Luxury"]
["Executive","Executive"]
["Family","Family Residential"]
["Condo","Condo"]
["Reno","Renovator"]
["First","First Time Buyer"]
[]
[]
["USED ATTRIBUTES"]
[]
["XML.type != Condo","XML.type = Condo"]
["property_id","property_id"]
{"$rows_left_out":33}